{"text_format":"1","workbook":"xlsx","n_sheets":3,"sheets":["Ech brisée-Contoles Tx débiteur","Feuil2","Feuil3"],"not_rendered":{"charts":0,"images":0,"macros":1,"external_links":0,"defined_names":0,"comments":0,"pivot_tables":0},"unopened":[],"bounds":{"document_bytes":16777216,"sheet_cells":100000,"rows_first":2000,"rows_last":500,"rows_between":2000,"halvings":0,"cell_chars":16384,"cell_head_chars":4096},"cells_cut":0,"cells_raw":0,"read":"whole","date_system":"1900"}

{"sheet":"Ech brisée-Contoles Tx débiteur","index":0,"n_rows":749,"n_cols":60,"rows_kept":749,"cut":false,"hidden":false,"merged":[[3,1,3,15],[3,16,3,19],[4,17,5,19],[6,17,6,19],[1,1,1,24],[4,6,5,6],[3,21,3,24],[4,11,4,14],[4,22,4,23],[10,59,11,59],[10,25,10,27],[10,58,11,58],[4,1,5,1],[4,24,5,24],[8,54,8,59],[4,3,5,3],[4,4,5,4],[4,5,5,5],[5,11,6,14],[6,22,6,23],[6,9,6,10],[4,2,5,2],[10,12,11,12],[10,13,11,13],[10,29,11,29],[385,57,385,58],[10,54,11,54],[10,55,11,55],[10,56,11,56],[10,57,11,57],[13,1,13,6],[377,8,377,13],[378,8,378,13],[10,1,11,1],[10,2,11,2],[10,4,11,4],[10,5,11,5],[10,6,11,6],[10,3,12,3],[10,8,11,8],[7,1,7,5],[5,21,5,23],[10,22,11,23],[10,14,12,17],[10,19,11,20],[10,9,11,9],[7,8,7,11],[4,8,5,8],[4,9,5,10],[10,10,11,10],[10,11,11,11],[8,1,8,6],[8,8,8,27],[382,15,382,17],[12,19,12,20],[12,22,12,23],[383,15,383,17],[8,29,8,44],[10,36,11,37],[10,42,10,44],[12,36,12,37],[12,39,12,40],[10,33,11,33],[10,32,11,32],[10,34,11,34],[10,39,11,40],[10,31,11,31],[10,30,11,30]]}
[]
[null,"Echéancier avec première échéance brisée (= majorée ou minorée) - Vérifier si le taux nominal proportionnel est conforme ou non au taux débiteur contractuel"]
[]
[null,"Caractéristiques du crédit - Renseigner ou sélectionner toutes les cellules matérialisées en vert…………..…….…...puis cliquer sur le bouton \"Calcul\"",null,null,null,null,null,null,null,null,null,null,null,null,null,null,"Taux débiteur réellement appliqué",null,null,null,null,"Comparaisons des résultats en valeurs relatives"]
[null,"Sélectionner le profil d'échéance qui convient","Durée totale en mois","Montant","Taux débiteur contractuel","Date 1ère mise à disposition des fonds","Date 1ère échéance",null,{"$f":"IF(H7=0,\"\",\"Première échéance brisée échéancier réel avec intérêts en ''Exact/360'' par défaut\")","v":"Première échéance brisée échéancier réel avec intérêts en ''Exact/360'' par défaut"},{"$f":"IF(H7=0,\"\",IF(B7=\"Variables\",\"Modification du montant de l'échéance impossible\",IF(P7=\"Oui\",\"Sélectionner ''Non'' cellule ''P7'' pour permettre la saisie éventuelle d'un autre montant\",\"Si le montant réel de la 1ère échéance est différent saisir échéance réelle\")))","v":"Si le montant réel de la 1ère échéance est différent saisir échéance réelle"},null,{"$f":"IF(H7=0,\"Pas d'échéance brisée - Calcul intérêts en mois normalisé\",IF(H7=1,\"Échéance minorée - Un seul calcul intérêts possible\n= ''Exact/Année civile''\",\"Échéance majorée - Sélectionner ci-dessous  l'option retenue pour le calcul des intérêts\"))","v":"Échéance majorée - Sélectionner ci-dessous  l'option retenue pour le calcul des intérêts"},null,null,null,"=> =>",null,{"$f":"IF(H7=0,\"Pas d'échéance brisée\",IF(R7=\"OK\",\"Le taux débiteur réellement appliqué est conforme aux taux débiteur contractuel\",\"Le taux débiteur réellement appliqué n'est pas conforme aux taux débiteur contractuel\"))","v":"Le taux débiteur réellement appliqué n'est pas conforme aux taux débiteur contractuel"},null,null,"Oui","Echéancier de référence avec calculs exacts","Echéancier réel",null,{"$f":"IF($R$7<>$Y$7,\"Le résultat indiqué en cellule ''Q7'' est à privilégier à cette estimation\",IF(W7<=V7,\"Taux débiteur contractuel bien respecté\",\"Taux débiteur contractuel non respecté\"))","v":"Taux débiteur contractuel non respecté"}]
[null,null,null,null,null,null,null,null,null,null,null,"Intérêts calculés en ''Exact/Année civile''\nPas d'échéance zéro fictive (hors décret mai 2016)",null,null,null,{"$f":"IF(AND(J7=\"\",B7=\"Constantes\"),\"Lissage échéances ?\",\"Lissage échéance\")","v":"Lissage échéances ?"},"Le taux débiteur réellement appliqué est",null,null,null,"Non","Approximation taux proportionnels = estimation par interpolation des Taux de Rendements Internes (TRI)\nExcel base 365 jours"]
[{"$f":"IF($B$7=\"Constantes\",1,0)","v":1},"Constantes",240,100000,0.02,"2020-01-05","2020-02-25",{"$f":"IF(I13=EDATE(K13,-1),0,IF(K17=\"\",1,2))","v":2},{"$f":"AF18","v":622.54},null,null,null,null,null,null,"Non",{"$f":"IF(H7=0,E7,BE13)","v":2.0004140586661848E-2},{"$f":"IF(H7=0,\"OK\",IF(BE13<=E7,\"OK\",\"KO\"))","v":"KO"},null,null,{"$f":"((1+(E7/12))^(12))-1","v":2.0184355681502009E-2},{"$f":"IF(H7=0,E7,AA13)","v":2.0003624608945537E-2},{"$f":"IF(H7=0,E7,AR13)","v":2.0007736327170469E-2},null,{"$f":"IF(W7<=V7,\"OK\",\"KO\")","v":"KO"}]
[null,{"$f":"IF(AND(B7=\"Variables\",P7=\"Oui\"),\"Modiification échéance impossible\",IF(AND($A$7=0,G7<=F7),\"IMPOSSIBLE - Dates échéances incohérentes\",IF(AND($A$7=0,D383<0),\"Intérêts négatifs - Echéances trop élevées\",IF(AND($A$7=0,E383<0),\"Échéances trop élevées - Amortissement de la dernieré écéhéance     =\",IF(AND($A$7=0,OR($E$383>$C$383,C383>C384)),\"Échéances trop faibles - Capital dû au terme du prêt        =\",IF(C7>360,\"IMPOSSIBLE - Durée maximale 360 mois\",IF(G7<=F7,\"IMPOSSIBLE - Dates échéances incohérentes\",\"\")))))))","v":""},null,null,null,null,{"$f":"IF(AND($A$7=0,D383<0),\"\",IF(AND($A$7=0,E383<0),E383,IF(AND($A$7=0,OR($E$383>$C$383,C383>C384)),E383,\"\")))","v":""},{"$f":"IF(AND($A$7=0,F382<0),F382,IF(AND($A$7=0,F383>H382),F383,\"\"))","v":""},{"$f":"IF(OR(B7=\"Variables\",J7>0),\"Modification échéance impossible\",IF(O8=0,\"Impossible - Sélectioner ''Non' en cellule ''P7''\",IF(J7>(AH18+(AI17*$E$13/12*2)),\"Le montant de la 1ère échéance semble trop élevé\",IF(AG18<0,\"Impossible - Intérêts négatifs\",\"\"))))","v":""},null,null,null,null,null,{"$f":"IF(AND(P7=\"Oui\",J7>0),0,1)","v":1},{"$f":"IF(OR(J7<>\"\",$B$7=\"Variables\"),\"Non\",P7)","v":"Non"}]
[null,"Tableau d'amortissement prévisionnel joint à l'offre de prêt (Sans échéance brisée)",null,null,null,null,null,null,"Echéancier avec calcul exact intérêts échéance brisée \"Exact/année civile\" ou bien \"Échéance fictive avec mois normalisé + exact/année civile pour jours résiduels\"",null,null,null,null,null,null,null,null,null,null,null,null,null,null,null,null,null,null,null,null,"Echéancier réel avec intérêts de la première échéance brisée pas forcément bien calculés - Par défaut calcul en \"Exact/360\"",null,null,null,null,null,null,null,null,null,null,null,null,null,null,null,null,null,null,null,null,null,null,null,null,"Cacul du taux débiteur réellement appliqué"]
[]
[null,"Durée totale en mois","Montant",{"$f":"IF($A$7=0,\"Saisir les paliers d'échéances ou  diverses échéances\",\"Type d'échéances\")","v":"Type d'échéances"},"Taux débiteur contractuel",null,null,null,"Date 1ère mise à disposition des fonds","Rang","Date 1ère échéance","Date un an antérieur","Nombre jours année ciivile","Nombre jours courus",{"$f":"IF(H7=0,L5,IF(H7=1,L5,L6))","v":"Intérêts calculés en ''Exact/Année civile''\nPas d'échéance zéro fictive (hors décret mai 2016)"},null,null,null,null,"Approximation taux débiteur sur une période en dessus soit :",null,{"$f":"IF($H$7=1,$B$13,B13+1)","v":241},"Approximation taux débiteur sur une période en deçà soit :",null,{"$f":"IF($H$7=1,B13-1,B13)","v":240},"Taux estimé corrigé par Interpolation TRI ",null,null,null,"Durée totale en mois","Montant","Taux débiteur contractuel",{"$f":"I11","v":"Date 1ère mise à disposition des fonds"},{"$f":"K11","v":"Date 1ère échéance"},null,null,"Approximation taux débiteur sur une période en dessus soit :",null,{"$f":"V11","v":241},"Approximation taux débiteur sur une période en deçà soit :",null,{"$f":"Y11","v":240},"Taux estimé corrigé par Interpolation TRI ",null,null,null,null,null,null,null,null,null,null,null,"Durée totale en mois","Montant","Taux débiteur réellement appliqué",{"$f":"AG11","v":"Date 1ère mise à disposition des fonds"},{"$f":"AH11","v":"Date 1ère échéance"},"Valeur à atteindre"]
[null,null,null,null,null,null,null,null,null,null,null,null,null,null,null,null,null,null,null,null,null,"périodes",null,null,"périodes","1 jour",{"$f":"V11","v":241},{"$f":"Y11","v":240},null,null,null,null,null,null,null,null,null,null,"périodes",null,null,"périodes","1 jour",{"$f":"AM11","v":241},{"$f":"AP11","v":240}]
[null,{"$f":"$C$7","v":240},{"$f":"D7","v":100000},null,{"$f":"E7","v":0.02},null,null,null,{"$f":"F7","v":"2020-01-05"},null,{"$f":"G7","v":"2020-02-25"},null,null,null,null,null,null,null,null,{"$f":"IF($H$7=1,\"Estimation taux débiteur maxi\",\"Estimation taux débiteur mini\")","v":"Estimation taux débiteur mini"},null,{"$f":"V378*12","v":1.9942806068854679E-2},{"$f":"IF($H$7=1,\"Estimation taux débiteur mini\",\"Estimation taux débiteur maxi\")","v":"Estimation taux débiteur maxi"},null,{"$f":"Y378*12","v":2.0120396205919988E-2},{"$f":"IF($V$13>$Y$13,($V$13-$Y$13)/(365/12),($Y$13-$V$13)/(365/12))","v":5.838579848722481E-6},{"$f":"IF($H$7=2,IF($V$13<$Y$13,$V$13+($Z$13*((365/12)-$N$17)),$Y$13-($Z$13*$N$17)),IF($V$13>$Y$13,$V$13-($Z$13*((365/12)-$N$18)),$Y$13+($Z$13*$N$18)))","v":2.0003624608945537E-2},{"$f":"IF($H$7=2,IF($Y$13>$V$13,$Y$13-($Z$13*$N$17),$Y$13+($Z$13*((365/12)-$N$17))),IF($Y$13<$V$13,$Y$13+($Z$13*$N$18),$Y$13-($Z$13*((365/12)-$N$18))))","v":2.0003624608945537E-2},null,{"$f":"B13","v":240},{"$f":"C13","v":100000},{"$f":"E13","v":0.02},{"$f":"I13","v":"2020-01-05"},{"$f":"K13","v":"2020-02-25"},null,null,{"$f":"IF($H$7=1,\"Estimation taux débiteur maxi\",\"Estimation taux débiteur mini\")","v":"Estimation taux débiteur mini"},null,{"$f":"AM378*12","v":1.9946902068173067E-2},{"$f":"IF($H$7=1,\"Estimation taux débiteur mini\",\"Estimation taux débiteur maxi\")","v":"Estimation taux débiteur maxi"},null,{"$f":"AP378*12","v":2.0124538104445477E-2},{"$f":"IF($AM$13>$AP$13,($AM$13-$AP$13)/(365/12),($AP$13-$AM$13)/(365/12))","v":5.8400888637504832E-6},{"$f":"IF($H$7=2,IF($AM$13<$AP$13,$AM$13+($AQ$13*((365/12)-$N$17)),$AP$13-($AQ$13*$N$17)),IF($AM$13>$AP$13,$AM$13-($AQ$13*((365/12)-$N$18)),$AP$13+($AQ$13*$N$18)))","v":2.0007736327170469E-2},{"$f":"IF($H$7=2,IF($AP$13>$AM$13,$AP$13-($AQ$13*$N$17),$AP$13+($AQ$13*((365/12)-$N$17))),IF($AP$13<$AM$13,$AP$13+($AQ$13*$N$18),$AP$13-($AQ$13*((365/12)-$N$18))))","v":2.0007736327170469E-2},null,null,null,null,null,null,null,null,null,{"$f":"AD13","v":240},{"$f":"AE13","v":100000},2.0004140586661848E-2,{"$f":"AG13","v":"2020-01-05"},{"$f":"AH13","v":"2020-02-25"},{"$f":"AG378-BF378","v":4.0699658711673692E-5}]
[null,null,null,null,null,null,null,null,null,null,null,null,null,null,null,null,null,null,null,null,null,null,null,null,null,null,null,null,null,null,{"$f":"AF14","v":505.60500000000593},505.60500000000593,{"$f":"IF(J7>0,J7-AH18,IF(K15=22,((AI17*E13/12)+(AI17*E13/360*N17)),AI17*$E$13/360*N18))","v":283.33333333333331}]
[null,"Rang","Échéance",{"$f":"B7","v":"Constantes"},"Intérêts","Amortissement","Capital dû",null,null,null,{"$f":"IF(AND(H7=2,L6=I378),21,IF(AND(H7=2,I379),22,\"\"))","v":21},null,null,null,{"$f":"(IF(P7=\"Oui\",\"Échéance figée\",\"Échéance\"))","v":"Échéance"},"Intérêts calculs corrests",{"$f":"IF($P$8=\"Non\",\"Amortissement figé\",\"Amortissement\")","v":"Amortissement figé"},"Capital dû",null,null,null,null,null,null,null,null,null,null,null,"Rang","Dates échéances","Échéance","Intérêts calculs incorrects",null,"Capital dû",null,null,null,null,null,null,null,null,null,null,null,null,null,null,null,null,null,null,null,"Rang","Dates échéances","Échéance figée","Intérêts","Amortissement","Capital dû"]
[null,0,null,null,null,null,{"$f":"C13","v":100000},null,"Échéance zéro réelle",0,{"$f":"I13","v":"2020-01-05"},{"$f":"EDATE(K16,-12)","v":"2019-01-05"},{"$f":"K16-L16","v":365},null,null,null,null,{"$f":"G16","v":100000},null,{"$f":"IF($H$7=1,EDATE(K18,-1),EDATE(K17,-1))","v":"2019-12-25"},0,{"$f":"R16","v":100000},null,null,null,null,null,null,null,{"$f":"J16","v":0},{"$f":"K16","v":"2020-01-05"},null,null,null,{"$f":"R16","v":100000},null,{"$f":"T16","v":"2019-12-25"},{"$f":"U16","v":0},{"$f":"AI16","v":100000},null,null,null,null,null,null,null,null,null,null,null,{"$f":"K16","v":43835},null,null,null,{"$f":"AD16","v":0},{"$f":"AE16","v":"2020-01-05"},null,null,null,{"$f":"AI16","v":100000}]
[null,0,null,null,null,null,{"$f":"G16","v":100000},null,{"$f":"IF(K17=\"\",\"\",\"Échéance zéro fictive\")","v":"Échéance zéro fictive"},{"$f":"IF(K17=\"\",\"\",0)","v":0},{"$f":"IF((EDATE(K18,-1))<K16,\"\",EDATE(K18,-1))","v":"2020-01-25"},{"$f":"IF(K17=\"\",\"\",EDATE(K17,-12))","v":"2019-01-25"},{"$f":"IF(K17=\"\",\"\",K17-L17)","v":365},{"$f":"IF(K17=\"\",0,K17-K16)","v":20},null,null,null,{"$f":"R16","v":100000},null,{"$f":"EDATE(T16,1)","v":"2020-01-25"},1,{"$f":"IF($H$7=1,-O18,0)","v":0},{"$f":"IF($H$7=1,EDATE(K18,-1),K17)","v":"2020-01-25"},0,{"$f":"V16","v":100000},null,null,null,null,0,"2020-01-25",null,null,null,{"$f":"R17","v":100000},{"$f":"IF(AD17<>$C$7,10000,AI387)","v":10000},"2020-01-25",1,{"$f":"IF($H$7=1,-AF18,0)","v":0},{"$f":"W17","v":"2020-01-25"},0,{"$f":"AM16","v":100000},null,null,null,null,null,null,null,null,{"$f":"IF($H$7=1,0,K17)","v":43855},null,null,null,0,"2020-01-25",null,null,null,{"$f":"AI17","v":100000}]
[null,1,{"$f":"IF(AND($A$7=0,$B18>$C$7),0,IF(AND($A$7=0,$B18=$C$7),ROUND(($F18+$E18),2),IF(AND($A$7=0,$D18=0),ROUND($C17,2),IF(AND($A$7=0,$B18=$B$13),ROUND($F18+$E18,2),IF($B18>$B$13,0,IF(AND($A$7=0,$D18<>0),ROUND($D18,2),IF($B18>$B$13,0,IF($B18=$B$13,ROUND($F18+$E18,2),ROUND(-PMT($E$13/12,$B$13,$C$13,0,0),2)))))))))","v":505.88},400,{"$f":"IF(B18>$B$13,0,ROUND(G17*$E$13/12,2))","v":166.67},{"$f":"IF(B18>$B$13,0,IF(B18=$B$13,G17,C18-E18))","v":339.21000000000004},{"$f":"IF(B18>$B$13,0,G17-F18)","v":99660.79},null,null,1,{"$f":"K13","v":"2020-02-25"},{"$f":"EDATE(K18,-12)","v":"2019-02-25"},{"$f":"K18-L18","v":365},{"$f":"K18-K16","v":51},{"$f":"IF(J18>$C$7,0,IF($P$7=\"Oui\",IF(J18=$C$7,ROUND(Q18+P18,2),ROUND($AE$14,2)),Q18+P18))","v":618.6620547945206},{"$f":"IF(H7=0,R17*$E$13/12,IF(H7=1,R17*E13/M18*N18,IF(K15=21,R17*$E$13/M18*N18,IF(K15=22,(R17*$E$13/12)+(R17*$E$13/M17*N17),\"\"))))","v":279.45205479452051},{"$f":"IF($P$7=\"Oui\",O18-P18,F18)","v":339.21000000000004},{"$f":"IF(J18>$B$13,0,R17-Q18)","v":99660.79},null,{"$f":"EDATE(T17,1)","v":"2020-02-25"},2,{"$f":"IF(U18>$V$11,0,IF($H$7=1,-O19,-O18))","v":-618.6620547945206},{"$f":"EDATE(W17,1)","v":"2020-02-25"},1,{"$f":"IF(X18>$Y$11,0,IF($H$7=1,-O18,V18))","v":-618.6620547945206},null,null,null,null,1,"2020-02-25",{"$f":"IF($P$7=\"Oui\",AE14,ROUND(AH18+AG18,2))","v":622.54},{"$f":"IF(AG14<>(AI17*$E$13/360*N18),AG14,AI17*$E$7/360*N18)","v":283.33333333333331},{"$f":"IF($P$7=\"Oui\",IF(AD18=$C$7,AI17,AF18-AG18),Q18)","v":339.21000000000004},{"$f":"AI17-AH18","v":99660.79},10000,"2020-02-25",2,{"$f":"IF(AL18>$V$11,0,IF($H$7=1,-AF19,-AF18))","v":-622.54},{"$f":"EDATE(AN17,1)","v":"2020-02-25"},1,{"$f":"IF(AO18>$Y$11,0,IF($H$7=1,-AF18,AM18))","v":-622.54},null,null,null,{"$f":"IF($B18=$C$7,B18,\"\")","v":""},{"$f":"IF($B18=$C$7,C18,\"\")","v":""},{"$f":"IF($B18=$C$7,E18,\"\")","v":""},{"$f":"IF($B18=$C$7,F18,\"\")","v":""},{"$f":"IF($B18=$C$7,G18,\"\")","v":""},{"$f":"K18","v":43886},null,{"$f":"IF($B18=$C$7,IF(AND($A$7=0,$B18>$C$7),0,IF(AND($A$7=0,$D18=0),$C17,IF(AND($A$7=0,$B18=$B$13),ROUNDDOWN($F18+$E18,2),IF($B18>$B$13,0,IF(AND($A$7=0,$D18<>0),$D18,IF($B18>$B$13,0,IF($B18=$B$13,ROUNDDOWN($F18+$E18,2),ROUND(-PMT($E$13/12,$B$13,$C$13,0,0),2)))))))))","v":false},null,1,"2020-02-25",{"$f":"AF18","v":622.54},{"$f":"IF(K15=22,((BH17*BE13/12)+(BH17*$BE$13/365*N17)),BH17*$BE$13/365*N18)","v":279.50990956705596},{"$f":"IF(BC18=$C$7,BH17,BE18-BF18)","v":343.03009043294401},{"$f":"BH17-BG18","v":99656.969909567051}]
[null,2,{"$f":"IF(AND($A$7=0,$B19>$C$7),0,IF(AND($A$7=0,$B19=$C$7),ROUND(($F19+$E19),2),IF(AND($A$7=0,$D19=0),ROUND($C18,2),IF(AND($A$7=0,$B19=$B$13),ROUND($F19+$E19,2),IF($B19>$B$13,0,IF(AND($A$7=0,$D19<>0),ROUND($D19,2),IF($B19>$B$13,0,IF($B19=$B$13,ROUND($F19+$E19,2),ROUND(-PMT($E$13/12,$B$13,$C$13,0,0),2)))))))))","v":505.88},null,{"$f":"IF(B19>$B$13,0,ROUND(G18*$E$13/12,2))","v":166.1},339.78,99321.01,null,null,2,{"$f":"EDATE(K18,1)","v":"2020-03-25"},null,null,null,{"$f":"IF(J19>$C$7,0,IF($P$7=\"Oui\",IF(J19=$C$7,ROUND(Q19+P19,2),$AE$14),ROUND(C19,2)))","v":505.88},{"$f":"IF($P$7=\"Oui\",R18*$E$7/12,ROUND(R18*$E$7/12,2))","v":166.1},{"$f":"IF($P$7=\"Oui\",O19-P19,F19)","v":339.78},{"$f":"IF(J19>$B$13,0,R18-Q19)","v":99321.01},null,"2020-03-25",3,-505.88,{"$f":"EDATE(W18,1)","v":"2020-03-25"},2,-505.88,null,null,null,null,2,"2020-03-25",{"$f":"IF(AD19>$C$7,0,IF($P$7=\"Oui\",IF(AD19=$C$7,AH19+AG19,$AE$14),O19))","v":505.88},{"$f":"IF($P$7=\"Oui\",AI18*$AF$13/12,AI18*$E$7/12)","v":166.10131666666666},{"$f":"IF($P$7=\"Oui\",IF(AD19=$C$7,AI18,AF19-AG19),Q19)","v":339.78},{"$f":"AI18-AH19","v":99321.01},10000,"2020-03-25",3,-505.88,{"$f":"EDATE(AN18,1)","v":"2020-03-25"},2,-505.88,null,null,null,"","","","","",43915,null,false,null,2,"2020-03-25",505.88,{"$f":"BH18*$BE$13/12","v":166.12933637597573},{"$f":"IF(BC19=$C$7,BH18,BE19-BF19)","v":339.75066362402424},{"$f":"BH18-BG19","v":99317.219245943023}]
[null,3,505.88,null,165.54,340.34000000000003,98980.67,null,null,3,{"$f":"EDATE(K19,1)","v":"2020-04-25"},null,null,null,{"$f":"IF(J20>$C$7,0,IF($P$7=\"Oui\",IF(J20=$C$7,ROUND(Q20+P20,2),$AE$14),ROUND(C20,2)))","v":505.88},{"$f":"IF($P$7=\"Oui\",R19*$E$7/12,ROUND(R19*$E$7/12,2))","v":165.54},340.34000000000003,98980.67,null,"2020-04-25",4,-505.88,"2020-04-25",3,-505.88,null,null,null,null,3,"2020-04-25",{"$f":"IF(AD20>$C$7,0,IF($P$7=\"Oui\",IF(AD20=$C$7,AH20+AG20,$AE$14),O20))","v":505.88},{"$f":"IF($P$7=\"Oui\",AI19*$AF$13/12,AI19*$E$7/12)","v":165.53501666666668},{"$f":"IF($P$7=\"Oui\",IF(AD20=$C$7,AI19,AF20-AG20),Q20)","v":340.34000000000003},98980.67,10000,"2020-04-25",4,-505.88,"2020-04-25",3,-505.88,null,null,null,"","","","","",43946,null,false,null,3,"2020-04-25",505.88,{"$f":"BH19*$BE$13/12","v":165.56296803934683},340.31703196065314,98976.902213982365]
[null,4,505.88,null,164.97,340.90999999999997,98639.76,null,null,4,"2020-05-25",null,null,null,505.88,164.97,340.90999999999997,98639.76,null,"2020-05-25",5,-505.88,"2020-05-25",4,-505.88,null,null,null,null,4,"2020-05-25",505.88,164.96778333333333,340.90999999999997,98639.76,10000,"2020-05-25",5,-505.88,"2020-05-25",4,-505.88,null,null,null,"","","","","",43976,null,false,null,4,"2020-05-25",505.88,164.99565556006544,340.88434443993458,98636.017869542426]
[null,5,505.88,null,164.4,341.48,98298.28,null,null,5,"2020-06-25",null,null,null,505.88,164.4,341.48,98298.28,null,"2020-06-25",6,-505.88,"2020-06-25",5,-505.88,null,null,null,null,5,"2020-06-25",505.88,164.39959999999999,341.48,98298.28,10000,"2020-06-25",6,-505.88,"2020-06-25",5,-505.88,null,null,null,"","","","","",44007,null,false,null,5,"2020-06-25",505.88,164.42739736423474,341.45260263576529,98294.565266906662]
[null,6,505.88,null,163.83000000000001,342.04999999999995,97956.23,null,null,6,"2020-07-25",null,null,null,505.88,163.83000000000001,342.04999999999995,97956.23,null,"2020-07-25",7,-505.88,"2020-07-25",6,-505.88,null,null,null,null,6,"2020-07-25",505.88,163.83046666666667,342.04999999999995,97956.23,10000,"2020-07-25",7,-505.88,"2020-07-25",6,-505.88,null,null,null,"","","","","",44037,null,false,null,6,"2020-07-25",505.88,163.85819187533414,342.02180812466588,97952.543458781991]
[null,7,505.88,null,163.26,342.62,97613.61,null,null,7,"2020-08-25",null,null,null,505.88,163.26,342.62,97613.61,null,"2020-08-25",8,-505.88,"2020-08-25",7,-505.88,null,null,null,null,7,"2020-08-25",505.88,163.26038333333332,342.62,97613.61,10000,"2020-08-25",8,-505.88,"2020-08-25",7,-505.88,null,null,null,"","","","","",44068,null,false,null,7,"2020-08-25",505.88,163.28803751421495,342.59196248578507,97609.951496296213]
[null,8,505.88,null,162.69,343.19,97270.42,null,null,8,"2020-09-25",null,null,null,505.88,162.69,343.19,97270.42,null,"2020-09-25",9,-505.88,"2020-09-25",8,-505.88,null,null,null,null,8,"2020-09-25",505.88,162.68935000000002,343.19,97270.42,10000,"2020-09-25",9,-505.88,"2020-09-25",8,-505.88,null,null,null,"","","","","",44099,null,false,null,8,"2020-09-25",505.88,162.71693269909613,343.16306730090389,97266.788428995307]
[null,9,505.88,null,162.12,343.76,96926.66,null,null,9,"2020-10-25",null,null,null,505.88,162.12,343.76,96926.66,null,"2020-10-25",10,-505.88,"2020-10-25",9,-505.88,null,null,null,null,9,"2020-10-25",505.88,162.11736666666667,343.76,96926.66,10000,"2020-10-25",10,-505.88,"2020-10-25",9,-505.88,null,null,null,"","","","","",44129,null,false,null,9,"2020-10-25",505.88,162.14487584555965,343.73512415444031,96923.053304840869]
[null,10,505.88,null,161.54,344.34000000000003,96582.32,null,null,10,"2020-11-25",null,null,null,505.88,161.54,344.34000000000003,96582.32,null,"2020-11-25",11,-505.88,"2020-11-25",10,-505.88,null,null,null,null,10,"2020-11-25",505.88,161.54443333333333,344.34000000000003,96582.32,10000,"2020-11-25",11,-505.88,"2020-11-25",10,-505.88,null,null,null,"","","","","",44160,null,false,null,10,"2020-11-25",505.88,161.5718653665464,344.30813463345362,96578.745170207418]
[null,11,505.88,null,160.97,344.90999999999997,96237.41,null,null,11,"2020-12-25",null,null,null,505.88,160.97,344.90999999999997,96237.41,null,"2020-12-25",12,-505.88,"2020-12-25",11,-505.88,null,null,null,null,11,"2020-12-25",505.88,160.97053333333335,344.90999999999997,96237.41,10000,"2020-12-25",12,-505.88,"2020-12-25",11,-505.88,null,null,null,"","","","","",44190,null,false,null,11,"2020-12-25",505.88,160.99789967235151,344.88210032764846,96233.863069879764]
[null,12,505.88,null,160.4,345.48,95891.930000000008,null,null,12,"2021-01-25",null,null,null,505.88,160.4,345.48,95891.930000000008,null,"2021-01-25",13,-505.88,"2021-01-25",12,-505.88,null,null,null,null,12,"2021-01-25",505.88,160.39568333333332,345.48,95891.930000000008,10000,"2021-01-25",13,-505.88,"2021-01-25",12,-505.88,null,null,null,"","","","","",44221,null,false,null,12,"2021-01-25",505.88,160.42297717062004,345.45702282937998,95888.40604705039]
[null,13,505.88,null,159.82,346.06,95545.87000000001,null,null,13,"2021-02-25",null,null,null,505.88,159.82,346.06,95545.87000000001,null,"2021-02-25",14,-505.88,"2021-02-25",13,-505.88,null,null,null,null,13,"2021-02-25",505.88,159.81988333333337,346.06,95545.87000000001,10000,"2021-02-25",14,-505.88,"2021-02-25",13,-505.88,null,null,null,"","","","","",44252,null,false,null,13,"2021-02-25",505.88,159.84709626634267,346.03290373365735,95542.373143316727]
[null,14,505.88,null,159.24,346.64,95199.23000000001,null,null,14,"2021-03-25",null,null,null,505.88,159.24,346.64,95199.23000000001,null,"2021-03-25",15,-505.88,"2021-03-25",14,-505.88,null,null,null,null,14,"2021-03-25",505.88,159.24311666666668,346.64,95199.23000000001,10000,"2021-03-25",15,-505.88,"2021-03-25",14,-505.88,null,null,null,"","","","","",44280,null,false,null,14,"2021-03-25",505.88,159.2702553618511,346.60974463814887,95195.76339867858]
[null,15,505.88,null,158.66999999999999,347.21000000000004,94852.02,null,null,15,"2021-04-25",null,null,null,505.88,158.66999999999999,347.21000000000004,94852.02,null,"2021-04-25",16,-505.88,"2021-04-25",15,-505.88,null,null,null,null,15,"2021-04-25",505.88,158.66538333333335,347.21000000000004,94852.02,10000,"2021-04-25",16,-505.88,"2021-04-25",15,-505.88,null,null,null,"","","","","",44311,null,false,null,15,"2021-04-25",505.88,158.69245285681373,347.18754714318629,94848.575851535395]
[null,16,505.88,null,158.09,347.78999999999996,94504.23000000001,null,null,16,"2021-05-25",null,null,null,505.88,158.09,347.78999999999996,94504.23000000001,null,"2021-05-25",17,-505.88,"2021-05-25",16,-505.88,null,null,null,null,16,"2021-05-25",505.88,158.08670000000001,347.78999999999996,94504.23000000001,10000,"2021-05-25",17,-505.88,"2021-05-25",16,-505.88,null,null,null,"","","","","",44341,null,false,null,16,"2021-05-25",505.88,158.11368714823115,347.76631285176882,94500.809538683621]
[null,17,505.88,null,157.51,348.37,94155.860000000015,null,null,17,"2021-06-25",null,null,null,505.88,157.51,348.37,94155.860000000015,null,"2021-06-25",18,-505.88,"2021-06-25",17,-505.88,null,null,null,null,17,"2021-06-25",505.88,157.50705000000002,348.37,94155.860000000015,10000,"2021-06-25",18,-505.88,"2021-06-25",17,-505.88,null,null,null,"","","","","",44372,null,false,null,17,"2021-06-25",505.88,157.53395663043185,348.34604336956818,94152.463495314048]
[null,18,505.88,null,156.93,348.95,93806.910000000018,null,null,18,"2021-07-25",null,null,null,505.88,156.93,348.95,93806.910000000018,null,"2021-07-25",19,-505.88,"2021-07-25",18,-505.88,null,null,null,null,18,"2021-07-25",505.88,156.92643333333336,348.95,93806.910000000018,10000,"2021-07-25",19,-505.88,"2021-07-25",18,-505.88,null,null,null,"","","","","",44402,null,false,null,18,"2021-07-25",505.88,156.95325969506749,348.92674030493254,93803.536755009118]
[null,19,505.88,null,156.34,349.53999999999996,93457.370000000024,null,null,19,"2021-08-25",null,null,null,505.88,156.34,349.53999999999996,93457.370000000024,null,"2021-08-25",20,-505.88,"2021-08-25",19,-505.88,null,null,null,null,19,"2021-08-25",505.88,156.34485000000004,349.53999999999996,93457.370000000024,10000,"2021-08-25",20,-505.88,"2021-08-25",19,-505.88,null,null,null,"","","","","",44433,null,false,null,19,"2021-08-25",505.88,156.37159473110867,349.50840526889135,93454.028349740227]
[null,20,505.88,null,155.76,350.12,93107.250000000029,null,null,20,"2021-09-25",null,null,null,505.88,155.76,350.12,93107.250000000029,null,"2021-09-25",21,-505.88,"2021-09-25",20,-505.88,null,null,null,null,20,"2021-09-25",505.88,155.76228333333339,350.12,93107.250000000029,10000,"2021-09-25",21,-505.88,"2021-09-25",20,-505.88,null,null,null,"","","","","",44464,null,false,null,20,"2021-09-25",505.88,155.78896012484046,350.09103987515954,93103.937309865069]
[null,21,505.88,null,155.18,350.7,92756.550000000032,null,null,21,"2021-10-25",null,null,null,505.88,155.18,350.7,92756.550000000032,null,"2021-10-25",22,-505.88,"2021-10-25",21,-505.88,null,null,null,null,21,"2021-10-25",505.88,155.17875000000006,350.7,92756.550000000032,10000,"2021-10-25",22,-505.88,"2021-10-25",21,-505.88,null,null,null,"","","","","",44494,null,false,null,21,"2021-10-25",505.88,155.20535425985767,350.6746457401423,92753.262664124923]
[null,22,505.88,null,154.59,351.28999999999996,92405.260000000038,null,null,22,"2021-11-25",null,null,null,505.88,154.59,351.28999999999996,92405.260000000038,null,"2021-11-25",23,-505.88,"2021-11-25",22,-505.88,null,null,null,null,22,"2021-11-25",505.88,154.59425000000007,351.28999999999996,92405.260000000038,10000,"2021-11-25",23,-505.88,"2021-11-25",22,-505.88,null,null,null,"","","","","",44525,null,false,null,22,"2021-11-25",505.88,154.62077551706071,351.25922448293932,92402.00343964198]
[null,23,505.88,null,154.01,351.87,92053.390000000043,null,null,23,"2021-12-25",null,null,null,505.88,154.01,351.87,92053.390000000043,null,"2021-12-25",24,-505.88,"2021-12-25",23,-505.88,null,null,null,null,23,"2021-12-25",505.88,154.00876666666673,351.87,92053.390000000043,10000,"2021-12-25",24,-505.88,"2021-12-25",23,-505.88,null,null,null,"","","","","",44555,null,false,null,23,"2021-12-25",505.88,154.03522227465081,351.84477772534922,92050.158661916634]
[null,24,505.88,null,153.41999999999999,352.46000000000004,91700.930000000037,null,null,24,"2022-01-25",null,null,null,505.88,153.41999999999999,352.46000000000004,91700.930000000037,null,"2022-01-25",25,-505.88,"2022-01-25",24,-505.88,null,null,null,null,24,"2022-01-25",505.88,153.42231666666675,352.46000000000004,91700.930000000037,10000,"2022-01-25",25,-505.88,"2022-01-25",24,-505.88,null,null,null,"","","","","",44586,null,false,null,24,"2022-01-25",505.88,153.44869290812576,352.43130709187426,91697.727354824761]
[null,25,505.88,null,152.83000000000001,353.04999999999995,91347.880000000034,null,null,25,"2022-02-25",null,null,null,505.88,152.83000000000001,353.04999999999995,91347.880000000034,null,"2022-02-25",26,-505.88,"2022-02-25",25,-505.88,null,null,null,null,25,"2022-02-25",505.88,152.83488333333341,353.04999999999995,91347.880000000034,10000,"2022-02-25",26,-505.88,"2022-02-25",25,-505.88,null,null,null,"","","","","",44617,null,false,null,25,"2022-02-25",505.88,152.86118579027519,353.01881420972484,91344.708540615044]
[null,26,505.88,null,152.25,353.63,90994.250000000029,null,null,26,"2022-03-25",null,null,null,505.88,152.25,353.63,90994.250000000029,null,"2022-03-25",27,-505.88,"2022-03-25",26,-505.88,null,null,null,null,26,"2022-03-25",505.88,152.24646666666672,353.63,90994.250000000029,10000,"2022-03-25",27,-505.88,"2022-03-25",26,-505.88,null,null,null,"","","","","",44645,null,false,null,26,"2022-03-25",505.88,152.27269929117622,353.6073007088238,90991.101239906217]
[null,27,505.88,null,151.66,354.22,90640.030000000028,null,null,27,"2022-04-25",null,null,null,505.88,151.66,354.22,90640.030000000028,null,"2022-04-25",28,-505.88,"2022-04-25",27,-505.88,null,null,null,null,27,"2022-04-25",505.88,151.65708333333339,354.22,90640.030000000028,10000,"2022-04-25",28,-505.88,"2022-04-25",27,-505.88,null,null,null,"","","","","",44676,null,false,null,27,"2022-04-25",505.88,151.68323177818874,354.19676822181123,90636.904471684407]
[null,28,505.88,null,151.07,354.81,90285.22000000003,null,null,28,"2022-05-25",null,null,null,505.88,151.07,354.81,90285.22000000003,null,"2022-05-25",29,-505.88,"2022-05-25",28,-505.88,null,null,null,null,28,"2022-05-25",505.88,151.06671666666671,354.81,90285.22000000003,10000,"2022-05-25",29,-505.88,"2022-05-25",28,-505.88,null,null,null,"","","","","",44706,null,false,null,28,"2022-05-25",505.88,151.09278161595122,354.78721838404874,90282.117253300356]
[null,29,505.88,null,150.47999999999999,355.4,89929.820000000036,null,null,29,"2022-06-25",null,null,null,505.88,150.47999999999999,355.4,89929.820000000036,null,"2022-06-25",30,-505.88,"2022-06-25",29,-505.88,null,null,null,null,29,"2022-06-25",505.88,150.4753666666667,355.4,89929.820000000036,10000,"2022-06-25",30,-505.88,"2022-06-25",29,-505.88,null,null,null,"","","","","",44737,null,false,null,29,"2022-06-25",505.88,150.50134716637578,355.37865283362419,89926.738600466735]
[null,30,505.88,null,149.88,356,89573.820000000036,null,null,30,"2022-07-25",null,null,null,505.88,149.88,356,89573.820000000036,null,"2022-07-25",31,-505.88,"2022-07-25",30,-505.88,null,null,null,null,30,"2022-07-25",505.88,149.8830333333334,356,89573.820000000036,10000,"2022-07-25",31,-505.88,"2022-07-25",30,-505.88,null,null,null,"","","","","",44767,null,false,null,30,"2022-07-25",505.88,149.90892678864392,355.97107321135604,89570.767527255375]
[null,31,505.88,null,149.29,356.59000000000003,89217.23000000004,null,null,31,"2022-08-25",null,null,null,505.88,149.29,356.59000000000003,89217.23000000004,null,"2022-08-25",32,-505.88,"2022-08-25",31,-505.88,null,null,null,null,31,"2022-08-25",505.88,149.28970000000007,356.59000000000003,89217.23000000004,10000,"2022-08-25",32,-505.88,"2022-08-25",31,-505.88,null,null,null,"","","","","",44798,null,false,null,31,"2022-08-25",505.88,149.31551883920187,356.5644811607981,89214.203046094583]
[null,32,505.88,null,148.69999999999999,357.18,88860.050000000047,null,null,32,"2022-09-25",null,null,null,505.88,148.69999999999999,357.18,88860.050000000047,null,"2022-09-25",33,-505.88,"2022-09-25",32,-505.88,null,null,null,null,32,"2022-09-25",505.88,148.69538333333341,357.18,88860.050000000047,10000,"2022-09-25",33,-505.88,"2022-09-25",32,-505.88,null,null,null,"","","","","",44829,null,false,null,32,"2022-09-25",505.88,148.72112167175598,357.15887832824399,88857.044167766333]
[null,33,505.88,null,148.1,357.78,88502.270000000048,null,null,33,"2022-10-25",null,null,null,505.88,148.1,357.78,88502.270000000048,null,"2022-10-25",34,-505.88,"2022-10-25",33,-505.88,null,null,null,null,33,"2022-10-25",505.88,148.1000833333334,357.78,88502.270000000048,10000,"2022-10-25",34,-505.88,"2022-10-25",33,-505.88,null,null,null,"","","","","",44859,null,false,null,33,"2022-10-25",505.88,148.12573363726824,357.75426636273176,88499.289901403608]
[null,34,505.88,null,147.5,358.38,88143.890000000043,null,null,34,"2022-11-25",null,null,null,505.88,147.5,358.38,88143.890000000043,null,"2022-11-25",35,-505.88,"2022-11-25",34,-505.88,null,null,null,null,34,"2022-11-25",505.88,147.50378333333342,358.38,88143.890000000043,10000,"2022-11-25",35,-505.88,"2022-11-25",34,-505.88,null,null,null,"","","","","",44890,null,false,null,34,"2022-11-25",505.88,147.52935308395175,358.35064691604828,88140.939254487559]
[null,35,505.88,null,146.91,358.97,87784.920000000042,null,null,35,"2022-12-25",null,null,null,505.88,146.91,358.97,87784.920000000042,null,"2022-12-25",36,-505.88,"2022-12-25",35,-505.88,null,null,null,null,35,"2022-12-25",505.88,146.9064833333334,358.97,87784.920000000042,10000,"2022-12-25",36,-505.88,"2022-12-25",35,-505.88,null,null,null,"","","","","",44920,null,false,null,35,"2022-12-25",505.88,146.93197835726593,358.94802164273403,87781.991232844826]
[null,36,505.88,null,146.31,359.57,87425.350000000035,null,null,36,"2023-01-25",null,null,null,505.88,146.31,359.57,87425.350000000035,null,"2023-01-25",37,-505.88,"2023-01-25",36,-505.88,null,null,null,null,36,"2023-01-25",505.88,146.30820000000008,359.57,87425.350000000035,10000,"2023-01-25",37,-505.88,"2023-01-25",36,-505.88,null,null,null,"","","","","",44951,null,false,null,36,"2023-01-25",505.88,146.33360779991213,359.54639220008789,87422.444840644734]
[null,37,505.88,null,145.71,360.16999999999996,87065.180000000037,null,null,37,"2023-02-25",null,null,null,505.88,145.71,360.16999999999996,87065.180000000037,null,"2023-02-25",38,-505.88,"2023-02-25",37,-505.88,null,null,null,null,37,"2023-02-25",505.88,145.70891666666674,360.16999999999996,87065.180000000037,10000,"2023-02-25",38,-505.88,"2023-02-25",37,-505.88,null,null,null,"","","","","",44982,null,false,null,37,"2023-02-25",505.88,145.73423975182899,360.14576024817097,87062.299080396566]
[null,38,505.88,null,145.11000000000001,360.77,86704.410000000033,null,null,38,"2023-03-25",null,null,null,505.88,145.11000000000001,360.77,86704.410000000033,null,"2023-03-25",39,-505.88,"2023-03-25",38,-505.88,null,null,null,null,38,"2023-03-25",505.88,145.10863333333342,360.77,86704.410000000033,10000,"2023-03-25",39,-505.88,"2023-03-25",38,-505.88,null,null,null,"","","","","",45010,null,false,null,38,"2023-03-25",505.88,145.13387255018779,360.74612744981221,86701.55295294676]
[null,39,505.88,null,144.51,361.37,86343.040000000037,null,null,39,"2023-04-25",null,null,null,505.88,144.51,361.37,86343.040000000037,null,"2023-04-25",40,-505.88,"2023-04-25",39,-505.88,null,null,null,null,39,"2023-04-25",505.88,144.50735000000006,361.37,86343.040000000037,10000,"2023-04-25",40,-505.88,"2023-04-25",39,-505.88,null,null,null,"","","","","",45041,null,false,null,39,"2023-04-25",505.88,144.53250452938781,361.34749547061222,86340.205457476142]
[null,40,505.88,null,143.91,361.97,85981.070000000036,null,null,40,"2023-05-25",null,null,null,505.88,143.91,361.97,85981.070000000036,null,"2023-05-25",41,-505.88,"2023-05-25",40,-505.88,null,null,null,null,40,"2023-05-25",505.88,143.90506666666673,361.97,85981.070000000036,10000,"2023-05-25",41,-505.88,"2023-05-25",40,-505.88,null,null,null,"","","","","",45071,null,{"$f":"IF($B57=$C$7,IF(AND($A$7=0,$B57>$C$7),0,IF(AND($A$7=0,$D57=0),$C56,IF(AND($A$7=0,$B57=$B$13),ROUNDDOWN($F57+$E57,2),IF($B57>$B$13,0,IF(AND($A$7=0,$D57<>0),$D57,IF($B57>$B$13,0,IF($B57=$B$13,ROUNDDOWN($F57+$E57,2),ROUND(-PMT($E$13/12,$B$13,$C$13,0,0),2)))))))))","v":false},null,40,"2023-05-25",505.88,143.93013402105177,361.9498659789482,85978.255591497189]
[null,41,505.88,null,143.30000000000001,362.58,85618.490000000034,null,null,41,"2023-06-25",null,null,null,505.88,143.30000000000001,362.58,85618.490000000034,null,"2023-06-25",42,-505.88,"2023-06-25",41,-505.88,null,null,null,null,41,"2023-06-25",505.88,143.30178333333339,362.58,85618.490000000034,10000,"2023-06-25",42,-505.88,"2023-06-25",41,-505.88,null,null,null,"","","","","",45102,null,{"$f":"IF($B58=$C$7,IF(AND($A$7=0,$B58>$C$7),0,IF(AND($A$7=0,$D58=0),$C57,IF(AND($A$7=0,$B58=$B$13),ROUNDDOWN($F58+$E58,2),IF($B58>$B$13,0,IF(AND($A$7=0,$D58<>0),$D58,IF($B58>$B$13,0,IF($B58=$B$13,ROUNDDOWN($F58+$E58,2),ROUND(-PMT($E$13/12,$B$13,$C$13,0,0),2)))))))))","v":false},null,41,"2023-06-25",505.88,143.32675935402122,362.5532406459788,85615.702350851207]
[null,42,505.88,null,142.69999999999999,363.18,85255.310000000041,null,null,42,"2023-07-25",null,null,null,505.88,142.69999999999999,363.18,85255.310000000041,null,"2023-07-25",43,-505.88,"2023-07-25",42,-505.88,null,null,null,null,42,"2023-07-25",505.88,142.69748333333339,363.18,85255.310000000041,10000,"2023-07-25",43,-505.88,"2023-07-25",42,-505.88,null,null,null,"","","","","",45132,null,false,null,42,"2023-07-25",505.88,142.72237885435189,363.15762114564814,85252.544729705565]
[null,43,505.88,null,142.09,363.78999999999996,84891.520000000048,null,null,43,"2023-08-25",null,null,null,505.88,142.09,363.78999999999996,84891.520000000048,null,"2023-08-25",44,-505.88,"2023-08-25",43,-505.88,null,null,null,null,43,"2023-08-25",505.88,142.0921833333334,363.78999999999996,84891.520000000048,10000,"2023-08-25",44,-505.88,"2023-08-25",43,-505.88,null,null,null,"","","","","",45163,null,false,null,43,"2023-08-25",505.88,142.11699084530898,363.76300915469102,84888.781720550876]
[null,44,505.88,null,141.49,364.39,84527.130000000048,null,null,44,"2023-09-25",null,null,null,505.88,141.49,364.39,84527.130000000048,null,"2023-09-25",45,-505.88,"2023-09-25",44,-505.88,null,null,null,null,44,"2023-09-25",505.88,141.48586666666674,364.39,84527.130000000048,10000,"2023-09-25",45,-505.88,"2023-09-25",44,-505.88,null,null,null,"","","","","",45194,null,false,null,44,"2023-09-25",505.88,141.51059364736253,364.3694063526375,84524.412314198242]
[null,45,505.88,null,140.88,365,84162.130000000048,null,null,45,"2023-10-25",null,null,null,505.88,140.88,365,84162.130000000048,null,"2023-10-25",46,-505.88,"2023-10-25",45,-505.88,null,null,null,null,45,"2023-10-25",505.88,140.87855000000008,365,84162.130000000048,10000,"2023-10-25",46,-505.88,"2023-10-25",45,-505.88,null,null,null,"","","","","",45224,null,false,null,45,"2023-10-25",505.88,140.90318557818279,364.97681442181721,84159.435499776431]
[null,46,505.88,null,140.27000000000001,365.61,83796.520000000048,null,null,46,"2023-11-25",null,null,null,505.88,140.27000000000001,365.61,83796.520000000048,null,"2023-11-25",47,-505.88,"2023-11-25",46,-505.88,null,null,null,null,46,"2023-11-25",505.88,140.27021666666676,365.61,83796.520000000048,10000,"2023-11-25",47,-505.88,"2023-11-25",46,-505.88,null,null,null,"","","","","",45255,null,false,null,46,"2023-11-25",505.88,140.29476495263563,365.58523504736434,83793.850264729073]
[null,47,505.88,null,139.66,366.22,83430.300000000047,null,null,47,"2023-12-25",null,null,null,505.88,139.66,366.22,83430.300000000047,null,"2023-12-25",48,-505.88,"2023-12-25",47,-505.88,null,null,null,null,47,"2023-12-25",505.88,139.66086666666675,366.22,83430.300000000047,10000,"2023-12-25",48,-505.88,"2023-12-25",47,-505.88,null,null,null,"","","","","",45285,null,false,null,47,"2023-12-25",505.88,139.68533008277771,366.19466991722231,83427.655594811848]
[null,48,505.88,null,139.05000000000001,366.83,83063.470000000045,null,null,48,"2024-01-25",null,null,null,505.88,139.05000000000001,366.83,83063.470000000045,null,"2024-01-25",49,-505.88,"2024-01-25",48,-505.88,null,null,null,null,48,"2024-01-25",505.88,139.05050000000008,366.83,83063.470000000045,10000,"2024-01-25",49,-505.88,"2024-01-25",48,-505.88,null,null,null,"","","","","",45316,null,false,null,48,"2024-01-25",505.88,139.07487927785184,366.80512072214816,83060.850474089704]
[null,49,505.88,null,138.44,367.44,82696.030000000042,null,null,49,"2024-02-25",null,null,null,505.88,138.44,367.44,82696.030000000042,null,"2024-02-25",50,-505.88,"2024-02-25",49,-505.88,null,null,null,null,49,"2024-02-25",505.88,138.43911666666676,367.44,82696.030000000042,10000,"2024-02-25",50,-505.88,"2024-02-25",49,-505.88,null,null,null,"","","","","",45347,null,false,null,49,"2024-02-25",505.88,138.46341084428241,367.41658915571759,82693.433884933984]
[null,50,505.88,null,137.83000000000001,368.04999999999995,82327.98000000004,null,null,50,"2024-03-25",null,null,null,505.88,137.83000000000001,368.04999999999995,82327.98000000004,null,"2024-03-25",51,-505.88,"2024-03-25",50,-505.88,null,null,null,null,50,"2024-03-25",505.88,137.82671666666673,368.04999999999995,82327.98000000004,10000,"2024-03-25",51,-505.88,"2024-03-25",50,-505.88,null,null,null,"","","","","",45376,null,false,null,50,"2024-03-25",505.88,137.8509230856705,368.02907691432949,82325.404808019652]
[null,51,505.88,null,137.21,368.66999999999996,81959.310000000041,null,null,51,"2024-04-25",null,null,null,505.88,137.21,368.66999999999996,81959.310000000041,null,"2024-04-25",52,-505.88,"2024-04-25",51,-505.88,null,null,null,null,51,"2024-04-25",505.88,137.21330000000006,368.66999999999996,81959.310000000041,10000,"2024-04-25",52,-505.88,"2024-04-25",51,-505.88,null,null,null,"","","","","",45407,null,false,null,51,"2024-04-25",505.88,137.23741430278935,368.64258569721062,81956.762222322446]
[null,52,505.88,null,136.6,369.28,81590.030000000042,null,null,52,"2024-05-25",null,null,null,505.88,136.6,369.28,81590.030000000042,null,"2024-05-25",53,-505.88,"2024-05-25",52,-505.88,null,null,null,null,52,"2024-05-25",505.88,136.59885000000006,369.28,81590.030000000042,10000,"2024-05-25",53,-505.88,"2024-05-25",52,-505.88,null,null,null,"","","","","",45437,null,false,null,52,"2024-05-25",505.88,136.62288279357958,369.25711720642039,81587.505105116026]
[null,53,505.88,null,135.97999999999999,369.9,81220.130000000048,null,null,53,"2024-06-25",null,null,null,505.88,135.97999999999999,369.9,81220.130000000048,null,"2024-06-25",54,-505.88,"2024-06-25",53,-505.88,null,null,null,null,53,"2024-06-25",505.88,135.98338333333342,369.9,81220.130000000048,10000,"2024-06-25",54,-505.88,"2024-06-25",53,-505.88,null,null,null,"","","","","",45468,null,false,null,53,"2024-06-25",505.88,136.00732685314435,369.87267314685562,81217.632431969178]
[null,54,505.88,null,135.37,370.51,80849.620000000054,null,null,54,"2024-07-25",null,null,null,505.88,135.37,370.51,80849.620000000054,null,"2024-07-25",55,-505.88,"2024-07-25",54,-505.88,null,null,null,null,54,"2024-07-25",505.88,135.36688333333342,370.51,80849.620000000054,10000,"2024-07-25",55,-505.88,"2024-07-25",54,-505.88,null,null,null,"","","","","",45498,null,false,null,54,"2024-07-25",505.88,135.39074477374484,370.48925522625518,80847.143176742917]
[null,55,505.88,null,134.75,371.13,80478.490000000049,null,null,55,"2024-08-25",null,null,null,505.88,134.75,371.13,80478.490000000049,null,"2024-08-25",56,-505.88,"2024-08-25",55,-505.88,null,null,null,null,55,"2024-08-25",505.88,134.74936666666676,371.13,80478.490000000049,10000,"2024-08-25",56,-505.88,"2024-08-25",55,-505.88,null,null,null,"","","","","",45529,null,false,null,55,"2024-08-25",505.88,134.77313484479538,371.10686515520462,80476.036311587712]
[null,56,505.88,null,134.13,371.75,80106.740000000049,null,null,56,"2024-09-25",null,null,null,505.88,134.13,371.75,80106.740000000049,null,"2024-09-25",57,-505.88,"2024-09-25",56,-505.88,null,null,null,null,56,"2024-09-25",505.88,134.13081666666676,371.75,80106.740000000049,10000,"2024-09-25",57,-505.88,"2024-09-25",56,-505.88,null,null,null,"","","","","",45560,null,false,null,56,"2024-09-25",505.88,134.1544953528587,371.72550464714129,80104.310806940572]
[null,57,505.88,null,133.51,372.37,79734.370000000054,null,null,57,"2024-10-25",null,null,null,505.88,133.51,372.37,79734.370000000054,null,"2024-10-25",58,-505.88,"2024-10-25",57,-505.88,null,null,null,null,57,"2024-10-25",505.88,133.51123333333342,372.37,79734.370000000054,10000,"2024-10-25",58,-505.88,"2024-10-25",57,-505.88,null,null,null,"","","","","",45590,null,false,null,57,"2024-10-25",505.88,133.53482458164126,372.34517541835874,79731.965631522209]
[null,58,505.88,null,132.88999999999999,372.99,79361.380000000048,null,null,58,"2024-11-25",null,null,null,505.88,132.88999999999999,372.99,79361.380000000048,null,"2024-11-25",59,-505.88,"2024-11-25",58,-505.88,null,null,null,null,58,"2024-11-25",505.88,132.89061666666677,372.99,79361.380000000048,10000,"2024-11-25",59,-505.88,"2024-11-25",58,-505.88,null,null,null,"","","","","",45621,null,false,null,58,"2024-11-25",505.88,132.9141208119884,372.96587918801163,79358.999752334203]
[null,59,505.88,null,132.27000000000001,373.61,78987.770000000048,null,null,59,"2024-12-25",null,null,null,505.88,132.27000000000001,373.61,78987.770000000048,null,"2024-12-25",60,-505.88,"2024-12-25",59,-505.88,null,null,null,null,59,"2024-12-25",505.88,132.26896666666676,373.61,78987.770000000048,10000,"2024-12-25",60,-505.88,"2024-12-25",59,-505.88,null,null,null,"","","","","",45651,null,false,null,59,"2024-12-25",505.88,132.29238232187967,373.5876176781203,78985.412134656086]
[null,60,505.88,null,131.65,374.23,78613.540000000052,null,null,60,"2025-01-25",null,null,null,505.88,131.65,374.23,78613.540000000052,null,"2025-01-25",61,-505.88,"2025-01-25",60,-505.88,null,null,null,null,60,"2025-01-25",505.88,131.6462833333334,374.23,78613.540000000052,10000,"2025-01-25",61,-505.88,"2025-01-25",60,-505.88,null,null,null,"","","","","",45682,null,false,null,60,"2025-01-25",505.88,131.66960738642391,374.21039261357612,78611.201742042511]
[null,61,505.88,null,131.02000000000001,374.86,78238.680000000051,null,null,61,"2025-02-25",null,null,null,505.88,131.02000000000001,374.86,78238.680000000051,null,"2025-02-25",62,-505.88,"2025-02-25",61,-505.88,null,null,null,null,61,"2025-02-25",505.88,131.02256666666676,374.86,78238.680000000051,10000,"2025-02-25",62,-505.88,"2025-02-25",61,-505.88,null,null,null,"","","","","",45713,null,false,null,61,"2025-02-25",505.88,131.04579427785458,374.83420572214538,78236.367536320366]
[null,62,505.88,null,130.4,375.48,77863.200000000055,null,null,62,"2025-03-25",null,null,null,505.88,130.4,375.48,77863.200000000055,null,"2025-03-25",63,-505.88,"2025-03-25",62,-505.88,null,null,null,null,62,"2025-03-25",505.88,130.3978000000001,375.48,77863.200000000055,10000,"2025-03-25",63,-505.88,"2025-03-25",62,-505.88,null,null,null,"","","","","",45741,null,false,null,62,"2025-03-25",505.88,130.42094126552496,375.45905873447504,77860.908477585894]
[null,63,505.88,null,129.77000000000001,376.11,77487.090000000055,null,null,63,"2025-04-25",null,null,null,505.88,129.77000000000001,376.11,77487.090000000055,null,"2025-04-25",64,-505.88,"2025-04-25",63,-505.88,null,null,null,null,{"$f":"J80","v":63},{"$f":"K80","v":"2025-04-25"},505.88,129.77200000000008,376.11,77487.090000000055,10000,{"$f":"T80","v":"2025-04-25"},{"$f":"U80","v":64},-505.88,"2025-04-25",63,-505.88,null,null,null,"","","","","",45772,null,false,null,{"$f":"AD80","v":63},{"$f":"AE80","v":"2025-04-25"},505.88,129.79504661590329,376.08495338409671,77484.823524201798]
[null,64,505.88,null,129.15,376.73,77110.360000000059,null,null,64,"2025-05-25",null,null,null,505.88,129.15,376.73,77110.360000000059,null,"2025-05-25",65,-505.88,"2025-05-25",64,-505.88,null,null,null,null,64,"2025-05-25",505.88,129.14515000000009,376.73,77110.360000000059,{"$f":"IF(AD81<>$C$7,10000,AI451)","v":10000},"2025-05-25",65,-505.88,"2025-05-25",64,-505.88,null,null,null,"","","","","",45802,null,false,null,64,"2025-05-25",505.88,129.16810859256799,376.71189140743201,77108.11163279436]
[null,65,505.88,null,128.52000000000001,{"$f":"IF(B82>$B$13,0,IF(B82=$B$13,G81,C82-E82))","v":377.36},{"$f":"IF(B82>$B$13,0,G81-F82)","v":76733.000000000058},null,null,65,"2025-06-25",null,null,null,505.88,128.52000000000001,377.36,76733.000000000058,null,{"$f":"EDATE(T81,1)","v":"2025-06-25"},66,{"$f":"IF(U82>$V$11,0,IF($H$7=1,-O83,-O82))","v":-505.88},"2025-06-25",65,{"$f":"IF(X82>$Y$11,0,IF($H$7=1,-O82,V82))","v":-505.88},null,null,null,null,65,"2025-06-25",505.88,128.51726666666676,377.36,76733.000000000058,10000,"2025-06-25",66,{"$f":"IF(AL82>$V$11,0,IF($H$7=1,-AF83,-AF82))","v":-505.88},"2025-06-25",65,{"$f":"IF(AO82>$Y$11,0,IF($H$7=1,-AF82,AM82))","v":-505.88},null,null,null,{"$f":"IF($B82=$C$7,B82,\"\")","v":""},{"$f":"IF($B82=$C$7,C82,\"\")","v":""},{"$f":"IF($B82=$C$7,E82,\"\")","v":""},{"$f":"IF($B82=$C$7,F82,\"\")","v":""},{"$f":"IF($B82=$C$7,G82,\"\")","v":""},{"$f":"K82","v":45833},null,false,null,65,"2025-06-25",{"$f":"AF82","v":505.88},128.54012545620284,{"$f":"IF(BC82=$C$7,BH81,BE82-BF82)","v":377.33987454379712},76730.771758250557]
[null,66,{"$f":"IF(AND($A$7=0,$B83>$C$7),0,IF(AND($A$7=0,$B83=$C$7),ROUND(($F83+$E83),2),IF(AND($A$7=0,$D83=0),ROUND($C82,2),IF(AND($A$7=0,$B83=$B$13),ROUND($F83+$E83,2),IF($B83>$B$13,0,IF(AND($A$7=0,$D83<>0),ROUND($D83,2),IF($B83>$B$13,0,IF($B83=$B$13,ROUND($F83+$E83,2),ROUND(-PMT($E$13/12,$B$13,$C$13,0,0),2)))))))))","v":505.88},null,{"$f":"IF(B83>$B$13,0,ROUND(G82*$E$13/12,2))","v":127.89},377.99,76355.010000000053,null,null,66,"2025-07-25",null,null,null,505.88,127.89,{"$f":"IF($P$7=\"Oui\",O83-P83,F83)","v":377.99},{"$f":"IF(J83>$B$13,0,R82-Q83)","v":76355.010000000053},null,"2025-07-25",67,-505.88,{"$f":"EDATE(W82,1)","v":"2025-07-25"},66,-505.88,null,null,null,null,66,"2025-07-25",505.88,127.88833333333343,377.99,{"$f":"AI82-AH83","v":76355.010000000053},10000,"2025-07-25",67,-505.88,{"$f":"EDATE(AN82,1)","v":"2025-07-25"},66,-505.88,null,null,null,"","","","","",45863,null,false,null,66,"2025-07-25",505.88,127.91109546459222,377.96890453540777,{"$f":"BH82-BG83","v":76352.802853715155}]
[null,67,505.88,null,127.26,378.62,75976.390000000058,null,null,67,{"$f":"EDATE(K83,1)","v":"2025-08-25"},null,null,null,{"$f":"IF(J84>$C$7,0,IF($P$7=\"Oui\",IF(J84=$C$7,ROUND(Q84+P84,2),$AE$14),ROUND(C84,2)))","v":505.88},{"$f":"IF($P$7=\"Oui\",R83*$E$7/12,ROUND(R83*$E$7/12,2))","v":127.26},378.62,75976.390000000058,null,"2025-08-25",68,-505.88,"2025-08-25",67,-505.88,null,null,null,null,67,"2025-08-25",{"$f":"IF(AD84>$C$7,0,IF($P$7=\"Oui\",IF(AD84=$C$7,AH84+AG84,$AE$14),O84))","v":505.88},{"$f":"IF($P$7=\"Oui\",AI83*$AF$13/12,AI83*$E$7/12)","v":127.25835000000008},{"$f":"IF($P$7=\"Oui\",IF(AD84=$C$7,AI83,AF84-AG84),Q84)","v":378.62},75976.390000000058,10000,"2025-08-25",68,-505.88,"2025-08-25",67,-505.88,null,null,null,"","","","","",45894,null,false,null,67,"2025-08-25",505.88,{"$f":"BH83*$BE$13/12","v":127.28101687261615},378.59898312738386,75974.203870587764]
[null,68,505.88,null,126.63,379.25,75597.140000000058,null,null,68,"2025-09-25",null,null,null,505.88,126.63,379.25,75597.140000000058,null,"2025-09-25",69,-505.88,"2025-09-25",68,-505.88,null,null,null,null,68,"2025-09-25",505.88,126.62731666666677,379.25,75597.140000000058,10000,"2025-09-25",69,-505.88,"2025-09-25",68,-505.88,null,null,null,"","","","","",45925,null,false,null,68,"2025-09-25",505.88,126.64988793224552,379.23011206775448,75594.973758520006]
[null,69,505.88,null,126,379.88,75217.260000000053,null,null,69,"2025-10-25",null,null,null,505.88,126,379.88,75217.260000000053,null,"2025-10-25",70,-505.88,"2025-10-25",69,-505.88,null,null,null,null,69,"2025-10-25",505.88,125.99523333333343,379.88,75217.260000000053,10000,"2025-10-25",70,-505.88,"2025-10-25",69,-505.88,null,null,null,"","","","","",45955,null,false,null,69,"2025-10-25",505.88,126.01770689253728,379.86229310746273,75215.111465412541]
[null,70,505.88,null,125.36,380.52,74836.740000000049,null,null,70,"2025-11-25",null,null,null,505.88,125.36,380.52,74836.740000000049,null,"2025-11-25",71,-505.88,"2025-11-25",70,-505.88,null,null,null,null,70,"2025-11-25",505.88,{"$f":"IF($P$7=\"Oui\",AI86*$AF$13/12,AI86*$E$7/12)","v":125.3621000000001},380.52,74836.740000000049,10000,"2025-11-25",71,-505.88,"2025-11-25",70,-505.88,null,null,null,"","","","","",45986,null,false,null,70,"2025-11-25",{"$f":"AF87","v":505.88},125.3844719996295,{"$f":"IF(BC87=$C$7,BH86,BE87-BF87)","v":380.49552800037048},74834.615937412178]
[null,71,505.88,null,124.73,381.15,74455.590000000055,null,null,71,"2025-12-25",null,null,null,505.88,124.73,381.15,74455.590000000055,null,"2025-12-25",72,-505.88,"2025-12-25",71,-505.88,null,null,null,null,71,"2025-12-25",505.88,124.72790000000009,381.15,74455.590000000055,10000,"2025-12-25",72,-505.88,"2025-12-25",71,-505.88,null,null,null,"","","","","",46016,null,false,null,71,"2025-12-25",{"$f":"AF88","v":505.88},124.75018149673654,{"$f":"IF(BC88=$C$7,BH87,BE88-BF88)","v":381.12981850326344},74453.486118908913]
[null,72,505.88,null,124.09,381.78999999999996,74073.800000000061,null,null,72,"2026-01-25",null,null,null,505.88,124.09,381.78999999999996,74073.800000000061,null,"2026-01-25",73,-505.88,"2026-01-25",72,-505.88,null,null,null,null,72,"2026-01-25",505.88,124.09265000000009,381.78999999999996,74073.800000000061,10000,"2026-01-25",73,-505.88,"2026-01-25",72,-505.88,null,null,null,"","","","","",46047,null,false,null,72,"2026-01-25",505.88,124.11483362414418,381.76516637585581,74071.720952533055]
[null,73,505.88,null,123.46,382.42,73691.380000000063,null,null,73,"2026-02-25",null,null,null,505.88,123.46,382.42,73691.380000000063,null,"2026-02-25",74,-505.88,"2026-02-25",73,-505.88,null,null,null,null,73,"2026-02-25",505.88,123.45633333333343,382.42,73691.380000000063,10000,"2026-02-25",74,-505.88,"2026-02-25",73,-505.88,null,null,null,"","","","","",46078,null,false,null,73,"2026-02-25",505.88,123.47842661920477,382.40157338079524,73689.319379152264]
[null,74,505.88,null,122.82,383.06,73308.320000000065,null,null,74,"2026-03-25",null,null,null,505.88,122.82,383.06,73308.320000000065,null,"2026-03-25",75,-505.88,"2026-03-25",74,-505.88,null,null,null,null,74,"2026-03-25",505.88,122.81896666666677,383.06,73308.320000000065,10000,"2026-03-25",75,-505.88,"2026-03-25",74,-505.88,null,null,null,"","","","","",46106,null,false,null,74,"2026-03-25",505.88,122.84095871633228,383.0390412836677,73306.280337868593]
[null,75,505.88,null,122.18,383.7,72924.620000000068,null,null,75,"2026-04-25",null,null,null,505.88,122.18,383.7,72924.620000000068,null,"2026-04-25",76,-505.88,"2026-04-25",75,-505.88,null,null,null,null,75,"2026-04-25",505.88,122.18053333333346,383.7,72924.620000000068,10000,"2026-04-25",76,-505.88,"2026-04-25",75,-505.88,null,null,null,"","","","","",46137,null,false,null,75,"2026-04-25",505.88,122.20242814699738,383.67757185300263,72922.602766015596]
[null,76,505.88,null,121.54,384.34,72540.280000000072,null,null,76,"2026-05-25",null,null,null,505.88,121.54,384.34,72540.280000000072,null,"2026-05-25",77,-505.88,"2026-05-25",76,-505.88,null,null,null,null,76,"2026-05-25",505.88,121.54103333333346,384.34,72540.280000000072,10000,"2026-05-25",77,-505.88,"2026-05-25",76,-505.88,null,null,null,"","","","","",46167,null,false,null,76,"2026-05-25",505.88,121.56283313972267,384.31716686027733,72538.285599155322]
[null,77,505.88,null,120.9,384.98,72155.300000000076,null,null,77,"2026-06-25",null,null,null,505.88,120.9,384.98,72155.300000000076,null,"2026-06-25",78,-505.88,"2026-06-25",77,-505.88,null,null,null,null,77,"2026-06-25",505.88,120.90046666666679,384.98,72155.300000000076,10000,"2026-06-25",78,-505.88,"2026-06-25",77,-505.88,null,null,null,"","","","","",46198,null,false,null,77,"2026-06-25",505.88,120.92217192007763,384.95782807992236,72153.327771075405]
[null,78,505.88,null,120.26,385.62,71769.68000000008,null,null,78,"2026-07-25",null,null,null,505.88,120.26,385.62,71769.68000000008,null,"2026-07-25",79,-505.88,"2026-07-25",78,-505.88,null,null,null,null,78,"2026-07-25",505.88,120.25883333333347,385.62,71769.68000000008,10000,"2026-07-25",79,-505.88,"2026-07-25",78,-505.88,null,null,null,"","","","","",46228,null,false,null,78,"2026-07-25",505.88,120.28044271067375,385.59955728932624,71767.728213786075]
[null,79,505.88,null,119.62,386.26,71383.420000000086,null,null,79,"2026-08-25",null,null,null,505.88,119.62,386.26,71383.420000000086,null,"2026-08-25",80,-505.88,"2026-08-25",79,-505.88,null,null,null,null,79,"2026-08-25",505.88,119.61613333333348,386.26,71383.420000000086,10000,"2026-08-25",80,-505.88,"2026-08-25",79,-505.88,null,null,null,"","","","","",46259,null,false,null,79,"2026-08-25",505.88,119.63764373115954,386.24235626884047,71381.48585751724]
[null,80,505.88,null,118.97,386.90999999999997,70996.510000000082,null,null,80,"2026-09-25",null,null,null,505.88,118.97,386.90999999999997,70996.510000000082,null,"2026-09-25",81,-505.88,"2026-09-25",80,-505.88,null,null,null,null,80,"2026-09-25",505.88,118.97236666666682,386.90999999999997,70996.510000000082,10000,"2026-09-25",81,-505.88,"2026-09-25",80,-505.88,null,null,null,"","","","","",46290,null,false,null,80,"2026-09-25",505.88,118.99377319821578,386.88622680178423,70994.599630715456]
[null,81,505.88,null,118.33,387.55,70608.960000000079,null,null,81,"2026-10-25",null,null,null,505.88,118.33,387.55,70608.960000000079,null,"2026-10-25",82,-505.88,"2026-10-25",81,-505.88,null,null,null,null,81,"2026-10-25",505.88,118.3275166666668,387.55,70608.960000000079,10000,"2026-10-25",82,-505.88,"2026-10-25",81,-505.88,null,null,null,"","","","","",46320,null,false,null,81,"2026-10-25",505.88,118.34882932555028,387.5311706744497,70607.068460041002]
[null,82,505.88,null,117.68,388.2,70220.760000000082,null,null,82,"2026-11-25",null,null,null,505.88,117.68,388.2,70220.760000000082,null,"2026-11-25",83,-505.88,"2026-11-25",82,-505.88,null,null,null,null,82,"2026-11-25",505.88,117.68160000000013,388.2,70220.760000000082,10000,"2026-11-25",83,-505.88,"2026-11-25",82,-505.88,null,null,null,"","","","","",46351,null,false,null,82,"2026-11-25",505.88,117.70281032389316,388.17718967610682,70218.891270364897]
[null,83,505.88,null,117.03,388.85,69831.910000000076,null,null,83,"2026-12-25",null,null,null,505.88,117.03,388.85,69831.910000000076,null,"2026-12-25",84,-505.88,"2026-12-25",83,-505.88,null,null,null,null,83,"2026-12-25",505.88,117.03460000000014,388.85,69831.910000000076,10000,"2026-12-25",84,-505.88,"2026-12-25",83,-505.88,null,null,null,"","","","","",46381,null,false,null,83,"2026-12-25",505.88,117.0557144009918,388.82428559900819,69830.066984765886]
[null,84,505.88,null,116.39,389.49,69442.420000000071,null,null,84,"2027-01-25",null,null,null,505.88,116.39,389.49,69442.420000000071,null,"2027-01-25",85,-505.88,"2027-01-25",84,-505.88,null,null,null,null,84,"2027-01-25",505.88,116.38651666666679,389.49,69442.420000000071,10000,"2027-01-25",85,-505.88,"2027-01-25",84,-505.88,null,null,null,"","","","","",46412,null,false,null,84,"2027-01-25",505.88,116.4075397616059,389.47246023839409,69440.594524527492]
[null,85,505.88,null,115.74,390.14,69052.280000000072,null,null,85,"2027-02-25",null,null,null,505.88,115.74,390.14,69052.280000000072,null,"2027-02-25",86,-505.88,"2027-02-25",85,-505.88,null,null,null,null,85,"2027-02-25",505.88,115.73736666666679,390.14,69052.280000000072,10000,"2027-02-25",86,-505.88,"2027-02-25",85,-505.88,null,null,null,"","","","","",46443,null,false,null,85,"2027-02-25",505.88,115.7582846075024,390.12171539249761,69050.472809134997]
[null,86,505.88,null,115.09,390.78999999999996,68661.490000000078,null,null,86,"2027-03-25",null,null,null,505.88,115.09,390.78999999999996,68661.490000000078,null,"2027-03-25",87,-505.88,"2027-03-25",86,-505.88,null,null,null,null,86,"2027-03-25",505.88,115.08713333333345,390.78999999999996,68661.490000000078,10000,"2027-03-25",87,-505.88,"2027-03-25",86,-505.88,null,null,null,"","","","","",46471,null,false,null,86,"2027-03-25",505.88,115.10794713745065,390.77205286254934,68659.700756272447]
[null,87,505.88,null,114.44,391.44,68270.050000000076,null,null,87,"2027-04-25",null,null,null,505.88,114.44,391.44,68270.050000000076,null,"2027-04-25",88,-505.88,"2027-04-25",87,-505.88,null,null,null,null,87,"2027-04-25",505.88,114.43581666666681,391.44,68270.050000000076,10000,"2027-04-25",88,-505.88,"2027-04-25",87,-505.88,null,null,null,"","","","","",46502,null,false,null,87,"2027-04-25",505.88,114.45652554721723,391.42347445278278,68268.277281819668]
[null,88,505.88,null,113.78,392.1,67877.95000000007,null,null,88,"2027-05-25",null,null,null,505.88,113.78,392.1,67877.95000000007,null,"2027-05-25",89,-505.88,"2027-05-25",88,-505.88,null,null,null,null,88,"2027-05-25",505.88,113.78341666666678,392.1,67877.95000000007,10000,"2027-05-25",89,-505.88,"2027-05-25",88,-505.88,null,null,null,"","","","","",46532,null,false,null,88,"2027-05-25",505.88,113.80401802956113,392.07598197043887,67876.201299849228]
[null,89,505.88,null,113.13,392.75,67485.20000000007,null,null,89,"2027-06-25",null,null,null,505.88,113.13,392.75,67485.20000000007,null,"2027-06-25",90,-505.88,"2027-06-25",89,-505.88,null,null,null,null,89,"2027-06-25",505.88,113.12991666666677,392.75,67485.20000000007,10000,"2027-06-25",90,-505.88,"2027-06-25",89,-505.88,null,null,null,"","","","","",46563,null,false,null,89,"2027-06-25",505.88,113.15042277422863,392.72957722577138,67483.47172262345]
[null,90,505.88,null,112.48,393.4,67091.800000000076,null,null,90,"2027-07-25",null,null,null,505.88,112.48,393.4,67091.800000000076,null,"2027-07-25",91,-505.88,"2027-07-25",90,-505.88,null,null,null,null,90,"2027-07-25",505.88,112.47533333333344,393.4,67091.800000000076,10000,"2027-07-25",91,-505.88,"2027-07-25",90,-505.88,null,null,null,"","","","","",46593,null,false,null,90,"2027-07-25",505.88,112.49573796794823,393.38426203205177,67090.0874605914]
[null,91,505.88,null,111.82,394.06,66697.740000000078,null,null,91,"2027-08-25",null,null,null,505.88,111.82,394.06,66697.740000000078,null,"2027-08-25",92,-505.88,"2027-08-25",91,-505.88,null,null,null,null,91,"2027-08-25",505.88,111.81966666666681,394.06,66697.740000000078,10000,"2027-08-25",92,-505.88,"2027-08-25",91,-505.88,null,null,null,"","","","","",46624,null,false,null,91,"2027-08-25",505.88,111.83996179442579,394.04003820557421,66696.047422385818]
[null,92,505.88,null,111.16,394.72,66303.020000000077,null,null,92,"2027-09-25",null,null,null,505.88,111.16,394.72,66303.020000000077,null,"2027-09-25",93,-505.88,"2027-09-25",92,-505.88,null,null,null,null,92,"2027-09-25",505.88,111.16290000000014,394.72,66303.020000000077,10000,"2027-09-25",93,-505.88,"2027-09-25",92,-505.88,null,null,null,"","","","","",46655,null,false,null,92,"2027-09-25",505.88,111.18309243433929,394.69690756566069,66301.350514820151]
[null,93,505.88,null,110.51,395.37,65907.650000000081,null,null,93,"2027-10-25",null,null,null,505.88,110.51,395.37,65907.650000000081,null,"2027-10-25",94,-505.88,"2027-10-25",93,-505.88,null,null,null,null,93,"2027-10-25",505.88,110.50503333333347,395.37,65907.650000000081,10000,"2027-10-25",94,-505.88,"2027-10-25",93,-505.88,null,null,null,"","","","","",46685,null,false,null,93,"2027-10-25",505.88,110.52512806533393,395.35487193466605,65905.995642885478]
[null,94,505.88,null,109.85,396.03,65511.620000000083,null,null,94,"2027-11-25",null,null,null,505.88,109.85,396.03,65511.620000000083,null,"2027-11-25",95,-505.88,"2027-11-25",94,-505.88,null,null,null,null,94,"2027-11-25",505.88,109.84608333333347,396.03,65511.620000000083,10000,"2027-11-25",95,-505.88,"2027-11-25",94,-505.88,null,null,null,"","","","","",46716,null,false,null,94,"2027-11-25",505.88,109.86606686201702,396.01393313798297,65509.981709747495]
[null,95,505.88,null,109.19,396.69,65114.93000000008,null,null,95,"2027-12-25",null,null,null,505.88,109.19,396.69,65114.93000000008,null,"2027-12-25",96,-505.88,"2027-12-25",95,-505.88,null,null,null,null,95,"2027-12-25",505.88,109.18603333333347,396.69,65114.93000000008,10000,"2027-12-25",96,-505.88,"2027-12-25",95,-505.88,null,null,null,"","","","","",46746,null,false,null,95,"2027-12-25",505.88,109.20590699595293,396.67409300404705,65113.307616743448]
[null,96,505.88,null,108.52,397.36,64717.57000000008,null,null,96,"2028-01-25",null,null,null,505.88,108.52,397.36,64717.57000000008,null,"2028-01-25",97,-505.88,"2028-01-25",96,-505.88,null,null,null,null,96,"2028-01-25",505.88,108.52488333333348,397.36,64717.57000000008,10000,"2028-01-25",97,-505.88,"2028-01-25",96,-505.88,null,null,null,"","","","","",46777,null,false,null,96,"2028-01-25",505.88,108.54464663565797,397.33535336434204,64715.97226337911]
[null,97,505.88,null,107.86,398.02,64319.550000000083,null,null,97,"2028-02-25",null,null,null,505.88,107.86,398.02,64319.550000000083,null,"2028-02-25",98,-505.88,"2028-02-25",97,-505.88,null,null,null,null,97,"2028-02-25",505.88,107.8626166666668,398.02,64319.550000000083,10000,"2028-02-25",98,-505.88,"2028-02-25",97,-505.88,null,null,null,"","","","","",46808,null,false,null,97,"2028-02-25",505.88,107.88228394659536,397.99771605340464,64317.974547325706]
[null,98,505.88,null,107.2,398.68,63920.870000000083,null,null,98,"2028-03-25",null,null,null,505.88,107.2,398.68,63920.870000000083,null,"2028-03-25",99,-505.88,"2028-03-25",98,-505.88,null,null,null,null,98,"2028-03-25",505.88,107.19925000000013,398.68,63920.870000000083,10000,"2028-03-25",99,-505.88,"2028-03-25",98,-505.88,null,null,null,"","","","","",46837,null,false,null,98,"2028-03-25",505.88,107.21881709117015,398.66118290882986,63919.313364416877]
[null,99,505.88,null,106.53,399.35,63521.520000000084,null,null,99,"2028-04-25",null,null,null,505.88,106.53,399.35,63521.520000000084,null,"2028-04-25",100,-505.88,"2028-04-25",99,-505.88,null,null,null,null,99,"2028-04-25",505.88,106.53478333333346,399.35,63521.520000000084,10000,"2028-04-25",100,-505.88,"2028-04-25",99,-505.88,null,null,null,"","","","","",46868,null,false,null,99,"2028-04-25",505.88,106.55424422872407,399.32575577127591,63519.987608645599]
[null,100,505.88,null,105.87,400.01,63121.510000000082,null,null,100,"2028-05-25",null,null,null,505.88,105.87,400.01,63121.510000000082,null,"2028-05-25",101,-505.88,"2028-05-25",100,-505.88,null,null,null,null,100,"2028-05-25",505.88,105.86920000000015,400.01,63121.510000000082,10000,"2028-05-25",101,-505.88,"2028-05-25",100,-505.88,null,null,null,"","","","","",46898,null,false,null,100,"2028-05-25",505.88,105.88856351553044,399.99143648446955,63119.996172161133]
[null,101,505.88,null,105.2,400.68,62720.830000000082,null,null,101,"2028-06-25",null,null,null,505.88,105.2,400.68,62720.830000000082,null,"2028-06-25",102,-505.88,"2028-06-25",101,-505.88,null,null,null,null,101,"2028-06-25",505.88,105.2025166666668,400.68,62720.830000000082,10000,"2028-06-25",102,-505.88,"2028-06-25",101,-505.88,null,null,null,"","","","","",46929,null,false,null,101,"2028-06-25",505.88,105.22177310478908,400.65822689521093,62719.337945265921]
[null,102,505.88,null,104.53,401.35,62319.480000000083,null,null,102,"2028-07-25",null,null,null,505.88,104.53,401.35,62319.480000000083,null,"2028-07-25",103,-505.88,"2028-07-25",102,-505.88,null,null,null,null,102,"2028-07-25",505.88,104.5347166666668,401.35,62319.480000000083,10000,"2028-07-25",103,-505.88,"2028-07-25",102,-505.88,null,null,null,"","","","","",46959,null,false,null,102,"2028-07-25",505.88,104.5538711466212,401.3261288533788,62318.011816412545]
[null,103,505.88,null,103.87,402.01,61917.470000000081,null,null,103,"2028-08-25",null,null,null,505.88,103.87,402.01,61917.470000000081,null,"2028-08-25",104,-505.88,"2028-08-25",103,-505.88,null,null,null,null,103,"2028-08-25",505.88,103.86580000000015,402.01,61917.470000000081,10000,"2028-08-25",104,-505.88,"2028-08-25",103,-505.88,null,null,null,"","","","","",46990,null,false,null,103,"2028-08-25",505.88,103.88485578806423,401.99514421193578,61916.016672200611]
[null,104,505.88,null,103.2,402.68,61514.790000000081,null,null,104,"2028-09-25",null,null,null,505.88,103.2,402.68,61514.790000000081,null,"2028-09-25",105,-505.88,"2028-09-25",104,-505.88,null,null,null,null,104,"2028-09-25",505.88,103.19578333333347,402.68,61514.790000000081,10000,"2028-09-25",105,-505.88,"2028-09-25",104,-505.88,null,null,null,"","","","","",47021,null,false,null,104,"2028-09-25",505.88,103.21472517306665,402.66527482693334,61513.351397373677]
[null,105,505.88,null,102.52,403.36,61111.43000000008,null,null,105,"2028-10-25",null,null,null,505.88,102.52,403.36,61111.43000000008,null,"2028-10-25",106,-505.88,"2028-10-25",105,-505.88,null,null,null,null,105,"2028-10-25",505.88,102.52465000000014,403.36,61111.43000000008,10000,"2028-10-25",106,-505.88,"2028-10-25",105,-505.88,null,null,null,"","","","","",47051,null,{"$f":"IF($B122=$C$7,IF(AND($A$7=0,$B122>$C$7),0,IF(AND($A$7=0,$D122=0),$C121,IF(AND($A$7=0,$B122=$B$13),ROUNDDOWN($F122+$E122,2),IF($B122>$B$13,0,IF(AND($A$7=0,$D122<>0),$D122,IF($B122>$B$13,0,IF($B122=$B$13,ROUNDDOWN($F122+$E122,2),ROUND(-PMT($E$13/12,$B$13,$C$13,0,0),2)))))))))","v":false},null,105,"2028-10-25",505.88,102.54347744248292,403.33652255751707,61110.014874816159]
[null,106,505.88,null,101.85,404.03,60707.400000000081,null,null,106,"2028-11-25",null,null,null,505.88,101.85,404.03,60707.400000000081,null,"2028-11-25",107,-505.88,"2028-11-25",106,-505.88,null,null,null,null,106,"2028-11-25",505.88,101.85238333333348,404.03,60707.400000000081,10000,"2028-11-25",107,-505.88,"2028-11-25",106,-505.88,null,null,null,"","","","","",47082,null,false,null,106,"2028-11-25",505.88,101.87111073406827,404.00888926593171,60706.005985550226]
[null,107,505.88,null,101.18,404.7,60302.700000000084,null,null,107,"2028-12-25",null,null,null,505.88,101.18,404.7,60302.700000000084,null,"2028-12-25",108,-505.88,"2028-12-25",107,-505.88,null,null,null,null,107,"2028-12-25",505.88,101.17900000000014,404.7,60302.700000000084,10000,"2028-12-25",108,-505.88,"2028-12-25",107,-505.88,null,null,null,"","","","","",47112,null,false,null,107,"2028-12-25",505.88,101.19762318247354,404.68237681752646,60301.323608732702]
[null,108,505.88,null,100.5,405.38,59897.320000000087,null,null,108,"2029-01-25",null,null,null,505.88,100.5,405.38,59897.320000000087,null,"2029-01-25",109,-505.88,"2029-01-25",108,-505.88,null,null,null,null,108,"2029-01-25",505.88,100.50450000000014,405.38,59897.320000000087,10000,"2029-01-25",109,-505.88,"2029-01-25",108,-505.88,null,null,null,"","","","","",47143,null,false,null,108,"2029-01-25",505.88,100.52301291924,405.35698708076001,59895.96662165194]
[null,109,505.88,null,99.83,406.05,59491.270000000084,null,null,109,"2029-02-25",null,null,null,505.88,99.83,406.05,59491.270000000084,null,"2029-02-25",110,-505.88,"2029-02-25",109,-505.88,null,null,null,null,109,"2029-02-25",505.88,99.828866666666826,406.05,59491.270000000084,10000,"2029-02-25",110,-505.88,"2029-02-25",109,-505.88,null,null,null,"","","","","",47174,null,false,null,109,"2029-02-25",505.88,99.847278072794253,406.03272192720573,59489.933899724732]
[null,110,505.88,null,99.15,406.73,59084.540000000081,null,null,110,"2029-03-25",null,null,null,505.88,99.15,406.73,59084.540000000081,null,"2029-03-25",111,-505.88,"2029-03-25",110,-505.88,null,null,null,null,110,"2029-03-25",505.88,99.152116666666814,406.73,59084.540000000081,10000,"2029-03-25",111,-505.88,"2029-03-25",110,-505.88,null,null,null,"","","","","",47202,null,false,null,110,"2029-03-25",505.88,99.170416768442848,406.70958323155713,59083.224316493179]
[null,111,505.88,null,98.47,407.40999999999997,58677.130000000077,null,null,111,"2029-04-25",null,null,null,505.88,98.47,407.40999999999997,58677.130000000077,null,"2029-04-25",112,-505.88,"2029-04-25",111,-505.88,null,null,null,null,111,"2029-04-25",505.88,98.474233333333473,407.40999999999997,58677.130000000077,10000,"2029-04-25",112,-505.88,"2029-04-25",111,-505.88,null,null,null,"","","","","",47233,null,false,null,111,"2029-04-25",505.88,98.492427128367282,407.3875728716327,58675.836743621549]
[null,112,505.88,null,97.8,408.08,58269.050000000076,null,null,112,"2029-05-25",null,null,null,505.88,97.8,408.08,58269.050000000076,null,"2029-05-25",113,-505.88,"2029-05-25",112,-505.88,null,null,null,null,112,"2029-05-25",505.88,97.795216666666803,408.08,58269.050000000076,10000,"2029-05-25",113,-505.88,"2029-05-25",112,-505.88,null,null,null,"","","","","",47263,null,false,null,112,"2029-05-25",505.88,97.813307271618683,408.06669272838133,58267.770050893167]
[null,113,505.88,null,97.12,408.76,57860.290000000074,null,null,113,"2029-06-25",null,null,null,505.88,97.12,408.76,57860.290000000074,null,"2029-06-25",114,-505.88,"2029-06-25",113,-505.88,null,null,null,null,113,"2029-06-25",505.88,97.115083333333459,408.76,57860.290000000074,10000,"2029-06-25",114,-505.88,"2029-06-25",113,-505.88,null,null,null,"","","","","",47294,null,false,null,113,"2029-06-25",505.88,97.133055314112639,408.74694468588734,57859.023106207278]
[null,114,505.88,null,96.43,409.45,57450.840000000077,null,null,114,"2029-07-25",null,null,null,505.88,96.43,409.45,57450.840000000077,null,"2029-07-25",115,-505.88,"2029-07-25",114,-505.88,null,null,null,null,114,"2029-07-25",505.88,96.4338166666668,409.45,57450.840000000077,10000,"2029-07-25",115,-505.88,"2029-07-25",114,-505.88,null,null,null,"","","","","",47324,null,false,null,114,"2029-07-25",505.88,96.451669368623882,409.42833063137613,57449.594775575904]
[null,115,505.88,null,95.75,410.13,57040.710000000079,null,null,115,"2029-08-25",null,null,null,505.88,95.75,410.13,57040.710000000079,null,"2029-08-25",116,-505.88,"2029-08-25",115,-505.88,null,null,null,null,115,"2029-08-25",505.88,95.751400000000118,410.13,57040.710000000079,10000,"2029-08-25",116,-505.88,"2029-08-25",115,-505.88,null,null,null,"","","","","",47355,null,false,null,115,"2029-08-25",505.88,95.769147544781205,410.11085245521878,57039.483923120686]
[null,116,505.88,null,95.07,410.81,56629.900000000081,null,null,116,"2029-09-25",null,null,null,505.88,95.07,410.81,56629.900000000081,null,"2029-09-25",117,-505.88,"2029-09-25",116,-505.88,null,null,null,null,116,"2029-09-25",505.88,95.067850000000135,410.81,56629.900000000081,10000,"2029-09-25",117,-505.88,"2029-09-25",116,-505.88,null,null,null,"","","","","",47386,null,false,null,116,"2029-09-25",505.88,95.085487949062042,410.79451205093795,56628.689411069747]
[null,117,505.88,null,94.38,411.5,56218.400000000081,null,null,117,"2029-10-25",null,null,null,505.88,94.38,411.5,56218.400000000081,null,"2029-10-25",118,-505.88,"2029-10-25",117,-505.88,null,null,null,null,117,"2029-10-25",505.88,94.383166666666796,411.5,56218.400000000081,10000,"2029-10-25",118,-505.88,"2029-10-25",117,-505.88,null,null,null,"","","","","",47416,null,false,null,117,"2029-10-25",505.88,94.400688684787369,411.47931131521261,56217.210099754535]
[null,118,505.88,null,93.7,412.18,55806.220000000081,null,null,118,"2029-11-25",null,null,null,505.88,93.7,412.18,55806.220000000081,null,"2029-11-25",119,-505.88,"2029-11-25",118,-505.88,null,null,null,null,118,"2029-11-25",505.88,93.697333333333475,412.18,55806.220000000081,10000,"2029-11-25",119,-505.88,"2029-11-25",118,-505.88,null,null,null,"","","","","",47447,null,false,null,118,"2029-11-25",505.88,93.714747852116332,412.16525214788368,55805.044847606652]
[null,119,505.88,null,93.01,412.87,55393.350000000079,null,null,119,"2029-12-25",null,null,null,505.88,93.01,412.87,55393.350000000079,null,"2029-12-25",120,-505.88,"2029-12-25",119,-505.88,null,null,null,null,119,"2029-12-25",505.88,93.010366666666812,412.87,55393.350000000079,10000,"2029-12-25",120,-505.88,"2029-12-25",119,-505.88,null,null,null,"","","","","",47477,null,false,null,119,"2029-12-25",505.88,93.027663548041062,412.85233645195893,55392.192511154695]
[null,120,505.88,null,92.32,413.56,54979.790000000081,null,null,120,"2030-01-25",null,null,null,505.88,92.32,413.56,54979.790000000081,null,"2030-01-25",121,-505.88,"2030-01-25",120,-505.88,null,null,null,null,120,"2030-01-25",505.88,92.322250000000125,413.56,54979.790000000081,10000,"2030-01-25",121,-505.88,"2030-01-25",120,-505.88,null,null,null,"","","","","",47508,null,false,null,120,"2030-01-25",505.88,92.339433866381341,413.54056613361865,54978.651945021076]
[null,121,505.88,635.19000000000005,91.63,414.25,54565.540000000081,null,null,121,"2030-02-25",null,null,null,505.88,91.63,414.25,54565.540000000081,null,"2030-02-25",122,-505.88,"2030-02-25",121,-505.88,null,null,null,null,121,"2030-02-25",505.88,91.63298333333347,414.25,54565.540000000081,10000,"2030-02-25",122,-505.88,"2030-02-25",121,-505.88,null,null,null,"","","","","",47539,null,false,null,121,"2030-02-25",505.88,91.65005689777928,414.22994310222072,54564.422001918858]
[null,122,505.88,null,90.94,414.94,54150.600000000079,null,null,122,"2030-03-25",null,null,null,505.88,90.94,414.94,54150.600000000079,null,"2030-03-25",123,-505.88,"2030-03-25",122,-505.88,null,null,null,null,122,"2030-03-25",505.88,90.942566666666792,414.94,54150.600000000079,10000,"2030-03-25",123,-505.88,"2030-03-25",122,-505.88,null,null,null,"","","","","",47567,null,false,null,122,"2030-03-25",505.88,90.959530729694151,414.92046927030583,54149.501532648552]
[null,123,505.88,null,90.25,415.63,53734.970000000081,null,null,123,"2030-04-25",null,null,null,505.88,90.25,415.63,53734.970000000081,null,"2030-04-25",124,-505.88,"2030-04-25",123,-505.88,null,null,null,null,123,"2030-04-25",505.88,90.251000000000133,415.63,53734.970000000081,10000,"2030-04-25",124,-505.88,"2030-04-25",123,-505.88,null,null,null,"","","","","",47598,null,false,null,123,"2030-04-25",505.88,90.267853446396899,415.61214655360311,53733.889386094947]
[null,124,505.88,null,89.56,416.32,53318.650000000081,null,null,124,"2030-05-25",null,null,null,505.88,89.56,416.32,53318.650000000081,null,"2030-05-25",125,-505.88,"2030-05-25",124,-505.88,null,null,null,null,124,"2030-05-25",505.88,89.558283333333463,416.32,53318.650000000081,10000,"2030-05-25",125,-505.88,"2030-05-25",124,-505.88,null,null,null,"","","","","",47628,null,false,null,124,"2030-05-25",505.88,89.575023128965015,416.30497687103497,53317.584409223913]
[null,125,505.88,null,88.86,417.02,52901.630000000085,null,null,125,"2030-06-25",null,null,null,505.88,88.86,417.02,52901.630000000085,null,"2030-06-25",126,-505.88,"2030-06-25",125,-505.88,null,null,null,null,125,"2030-06-25",505.88,88.864416666666799,417.02,52901.630000000085,10000,"2030-06-25",126,-505.88,"2030-06-25",125,-505.88,null,null,null,"","","","","",47659,null,false,null,125,"2030-06-25",505.88,88.881037855277086,416.9989621447229,52900.585447079189]
[null,126,505.88,null,88.17,417.71,52483.920000000086,null,null,126,"2030-07-25",null,null,null,505.88,88.17,417.71,52483.920000000086,null,"2030-07-25",127,-505.88,"2030-07-25",126,-505.88,null,null,null,null,126,"2030-07-25",505.88,88.169383333333485,417.71,52483.920000000086,10000,"2030-07-25",127,-505.88,"2030-07-25",126,-505.88,null,null,null,"","","","","",47689,null,false,null,126,"2030-07-25",505.88,88.185895700007492,417.69410429999249,52482.891342779199]
[null,127,505.88,null,87.47,418.40999999999997,52065.510000000082,null,null,127,"2030-08-25",null,null,null,505.88,87.47,418.40999999999997,52065.510000000082,null,"2030-08-25",128,-505.88,"2030-08-25",127,-505.88,null,null,null,null,{"$f":"J144","v":127},{"$f":"K144","v":"2030-08-25"},505.88,87.473200000000148,418.40999999999997,52065.510000000082,10000,{"$f":"T144","v":"2030-08-25"},{"$f":"U144","v":128},-505.88,"2030-08-25",127,-505.88,null,null,null,"","","","","",47720,null,false,null,{"$f":"AD144","v":127},{"$f":"AE144","v":"2030-08-25"},505.88,87.489594734621093,418.39040526537889,52064.500937513818]
[null,128,505.88,null,86.78,419.1,51646.410000000084,null,null,128,"2030-09-25",null,null,null,505.88,86.78,419.1,51646.410000000084,null,"2030-09-25",129,-505.88,"2030-09-25",128,-505.88,null,null,null,null,128,"2030-09-25",505.88,86.775850000000148,419.1,51646.410000000084,{"$f":"IF(AD145<>$C$7,10000,AI515)","v":10000},"2030-09-25",129,-505.88,"2030-09-25",128,-505.88,null,null,null,"","","","","",47751,null,false,null,128,"2030-09-25",505.88,86.792133027367825,419.08786697263218,51645.413070541188]
[null,129,505.88,null,86.08,{"$f":"IF(B146>$B$13,0,IF(B146=$B$13,G145,C146-E146))","v":419.8},{"$f":"IF(B146>$B$13,0,G145-F146)","v":51226.610000000081},null,null,129,"2030-10-25",null,null,null,505.88,86.08,419.8,51226.610000000081,null,{"$f":"EDATE(T145,1)","v":"2030-10-25"},130,{"$f":"IF(U146>$V$11,0,IF($H$7=1,-O147,-O146))","v":-505.88},"2030-10-25",129,{"$f":"IF(X146>$Y$11,0,IF($H$7=1,-O146,V146))","v":-505.88},null,null,null,null,129,"2030-10-25",505.88,86.077350000000138,419.8,51226.610000000081,10000,"2030-10-25",130,{"$f":"IF(AL146>$V$11,0,IF($H$7=1,-AF147,-AF146))","v":-505.88},"2030-10-25",129,{"$f":"IF(AO146>$Y$11,0,IF($H$7=1,-AF146,AM146))","v":-505.88},null,null,null,{"$f":"IF($B146=$C$7,B146,\"\")","v":""},{"$f":"IF($B146=$C$7,C146,\"\")","v":""},{"$f":"IF($B146=$C$7,E146,\"\")","v":""},{"$f":"IF($B146=$C$7,F146,\"\")","v":""},{"$f":"IF($B146=$C$7,G146,\"\")","v":""},{"$f":"K146","v":47781},null,false,null,129,"2030-10-25",505.88,86.093508643277445,419.78649135672254,51225.626579184463]
[null,130,{"$f":"IF(AND($A$7=0,$B147>$C$7),0,IF(AND($A$7=0,$B147=$C$7),ROUND(($F147+$E147),2),IF(AND($A$7=0,$D147=0),ROUND($C146,2),IF(AND($A$7=0,$B147=$B$13),ROUND($F147+$E147,2),IF($B147>$B$13,0,IF(AND($A$7=0,$D147<>0),ROUND($D147,2),IF($B147>$B$13,0,IF($B147=$B$13,ROUND($F147+$E147,2),ROUND(-PMT($E$13/12,$B$13,$C$13,0,0),2)))))))))","v":505.88},null,{"$f":"IF(B147>$B$13,0,ROUND(G146*$E$13/12,2))","v":85.38},420.5,50806.110000000081,null,null,130,"2030-11-25",null,null,null,505.88,85.38,{"$f":"IF($P$7=\"Oui\",O147-P147,F147)","v":420.5},{"$f":"IF(J147>$B$13,0,R146-Q147)","v":50806.110000000081},null,"2030-11-25",131,-505.88,{"$f":"EDATE(W146,1)","v":"2030-11-25"},130,-505.88,null,null,null,null,130,"2030-11-25",505.88,85.377683333333479,420.5,{"$f":"AI146-AH147","v":50806.110000000081},10000,"2030-11-25",131,-505.88,{"$f":"EDATE(AN146,1)","v":"2030-11-25"},130,-505.88,null,null,null,"","","","","",47812,null,false,null,130,"2030-11-25",505.88,85.39371964415399,420.48628035584602,{"$f":"BH146-BG147","v":50805.140298828621}]
[null,131,505.88,null,84.68,421.2,50384.910000000084,null,null,131,{"$f":"EDATE(K147,1)","v":"2030-12-25"},null,null,null,{"$f":"IF(J148>$C$7,0,IF($P$7=\"Oui\",IF(J148=$C$7,ROUND(Q148+P148,2),$AE$14),ROUND(C148,2)))","v":505.88},{"$f":"IF($P$7=\"Oui\",R147*$E$7/12,ROUND(R147*$E$7/12,2))","v":84.68},421.2,50384.910000000084,null,"2030-12-25",132,-505.88,"2030-12-25",131,-505.88,null,null,null,null,131,"2030-12-25",{"$f":"IF(AD148>$C$7,0,IF($P$7=\"Oui\",IF(AD148=$C$7,AH148+AG148,$AE$14),O148))","v":505.88},{"$f":"IF($P$7=\"Oui\",AI147*$AF$13/12,AI147*$E$7/12)","v":84.67685000000013},{"$f":"IF($P$7=\"Oui\",IF(AD148=$C$7,AI147,AF148-AG148),Q148)","v":421.2},50384.910000000084,10000,"2030-12-25",132,-505.88,"2030-12-25",131,-505.88,null,null,null,"","","","","",47842,null,false,null,131,"2030-12-25",505.88,{"$f":"BH147*$BE$13/12","v":84.692764088570584},421.18723591142941,50383.953062917193]
[null,132,505.88,null,83.97,421.90999999999997,49963.00000000008,null,null,132,"2031-01-25",null,null,null,505.88,83.97,421.90999999999997,49963.00000000008,null,"2031-01-25",133,-505.88,"2031-01-25",132,-505.88,null,null,null,null,132,"2031-01-25",505.88,83.974850000000146,421.90999999999997,49963.00000000008,10000,"2031-01-25",133,-505.88,"2031-01-25",132,-505.88,null,null,null,"","","","","",47873,null,false,null,132,"2031-01-25",505.88,83.990640031863947,421.88935996813603,49962.063702949054]
[null,133,505.88,null,83.27,422.61,49540.390000000079,null,null,133,"2031-02-25",null,null,null,505.88,83.27,422.61,49540.390000000079,null,"2031-02-25",134,-505.88,"2031-02-25",133,-505.88,null,null,null,null,133,"2031-02-25",505.88,83.271666666666803,422.61,49540.390000000079,10000,"2031-02-25",134,-505.88,"2031-02-25",133,-505.88,null,null,null,"","","","","",47904,null,false,null,133,"2031-02-25",505.88,83.287345526128988,422.59265447387099,49539.471048475185]
[null,134,505.88,null,82.57,423.31,49117.080000000082,null,null,134,"2031-03-25",null,null,null,505.88,82.57,423.31,49117.080000000082,null,"2031-03-25",135,-505.88,"2031-03-25",134,-505.88,null,null,null,null,134,"2031-03-25",505.88,82.567316666666798,423.31,49117.080000000082,10000,"2031-03-25",135,-505.88,"2031-03-25",134,-505.88,null,null,null,"","","","","",47932,null,false,null,134,"2031-03-25",505.88,82.582878620213492,423.29712137978652,49116.173927095399]
[null,135,505.88,null,81.86,424.02,48693.060000000085,null,null,135,"2031-04-25",null,null,null,505.88,81.86,424.02,48693.060000000085,null,"2031-04-25",136,-505.88,"2031-04-25",135,-505.88,null,null,null,null,135,"2031-04-25",505.88,81.861800000000144,424.02,48693.060000000085,10000,"2031-04-25",136,-505.88,"2031-04-25",135,-505.88,null,null,null,"","","","","",47963,null,false,null,135,"2031-04-25",{"$f":"AF152","v":505.88},81.877237359712623,{"$f":"IF(BC152=$C$7,BH151,BE152-BF152)","v":424.00276264028736},48692.171164455111]
[null,136,505.88,null,81.16,424.72,48268.340000000084,null,null,136,"2031-05-25",null,null,null,505.88,81.16,424.72,48268.340000000084,null,"2031-05-25",137,-505.88,"2031-05-25",136,-505.88,null,null,null,null,136,"2031-05-25",505.88,81.155100000000147,424.72,48268.340000000084,10000,"2031-05-25",137,-505.88,"2031-05-25",136,-505.88,null,null,null,"","","","","",47993,null,false,null,136,"2031-05-25",505.88,81.170419786963507,424.70958021303647,48267.461584242075]
[null,137,505.88,null,80.45,425.43,47842.910000000084,null,null,137,"2031-06-25",null,null,null,505.88,80.45,425.43,47842.910000000084,null,"2031-06-25",138,-505.88,"2031-06-25",137,-505.88,null,null,null,null,137,"2031-06-25",505.88,80.447233333333472,425.43,47842.910000000084,10000,"2031-06-25",138,-505.88,"2031-06-25",137,-505.88,null,null,null,"","","","","",48024,null,false,null,137,"2031-06-25",505.88,80.462423941039873,425.41757605896009,47842.044008183118]
[null,138,505.88,null,79.739999999999995,426.14,47416.770000000084,null,null,138,"2031-07-25",null,null,null,505.88,79.739999999999995,426.14,47416.770000000084,null,"2031-07-25",139,-505.88,"2031-07-25",138,-505.88,null,null,null,null,138,"2031-07-25",505.88,79.738183333333481,426.14,47416.770000000084,10000,"2031-07-25",139,-505.88,"2031-07-25",138,-505.88,null,null,null,"","","","","",48054,null,false,null,138,"2031-07-25",505.88,79.753247857746516,426.12675214225351,47415.917256040862]
[null,139,505.88,null,79.03,426.85,46989.920000000086,null,null,139,"2031-08-25",null,null,null,505.88,79.03,426.85,46989.920000000086,null,"2031-08-25",140,-505.88,"2031-08-25",139,-505.88,null,null,null,null,139,"2031-08-25",505.88,79.027950000000146,426.85,46989.920000000086,10000,"2031-08-25",140,-505.88,"2031-08-25",139,-505.88,null,null,null,"","","","","",48085,null,false,null,139,"2031-08-25",505.88,79.042889569613905,426.83711043038608,46989.080145610475]
[null,140,505.88,null,78.319999999999993,427.56,46562.360000000088,null,null,140,"2031-09-25",null,null,null,505.88,78.319999999999993,427.56,46562.360000000088,null,"2031-09-25",141,-505.88,"2031-09-25",140,-505.88,null,null,null,null,140,"2031-09-25",505.88,78.316533333333481,427.56,46562.360000000088,10000,"2031-09-25",141,-505.88,"2031-09-25",140,-505.88,null,null,null,"","","","","",48116,null,false,null,140,"2031-09-25",505.88,78.331347105892746,427.54865289410725,46561.531492716371]
[null,141,505.88,null,77.599999999999994,428.28,46134.080000000089,null,null,141,"2031-10-25",null,null,null,505.88,77.599999999999994,428.28,46134.080000000089,null,"2031-10-25",142,-505.88,"2031-10-25",141,-505.88,null,null,null,null,141,"2031-10-25",505.88,77.603933333333472,428.28,46134.080000000089,10000,"2031-10-25",142,-505.88,"2031-10-25",141,-505.88,null,null,null,"","","","","",48146,null,false,null,141,"2031-10-25",505.88,77.61861849254845,428.26138150745157,46133.27011120892]
[null,142,505.88,null,76.89,428.99,45705.090000000091,null,null,142,"2031-11-25",null,null,null,505.88,76.89,428.99,45705.090000000091,null,"2031-11-25",143,-505.88,"2031-11-25",142,-505.88,null,null,null,null,142,"2031-11-25",505.88,76.89013333333348,428.99,45705.090000000091,10000,"2031-11-25",143,-505.88,"2031-11-25",142,-505.88,null,null,null,"","","","","",48177,null,false,null,142,"2031-11-25",505.88,76.90470175225569,428.97529824774432,45704.294812961176]
[null,143,505.88,null,76.180000000000007,429.7,45275.390000000094,null,null,143,"2031-12-25",null,null,null,505.88,76.180000000000007,429.7,45275.390000000094,null,"2031-12-25",144,-505.88,"2031-12-25",143,-505.88,null,null,null,null,143,"2031-12-25",505.88,76.175150000000158,429.7,45275.390000000094,10000,"2031-12-25",144,-505.88,"2031-12-25",143,-505.88,null,null,null,"","","","","",48207,null,false,null,143,"2031-12-25",505.88,76.189594904392933,429.69040509560705,45274.604407865569]
[null,144,505.88,null,75.459999999999994,430.42,44844.970000000096,null,null,144,"2032-01-25",null,null,null,505.88,75.459999999999994,430.42,44844.970000000096,null,"2032-01-25",145,-505.88,"2032-01-25",144,-505.88,null,null,null,null,144,"2032-01-25",505.88,75.458983333333492,430.42,44844.970000000096,10000,"2032-01-25",145,-505.88,"2032-01-25",144,-505.88,null,null,null,"","","","","",48238,null,false,null,144,"2032-01-25",505.88,75.473295965036911,430.40670403496307,44844.197703830607]
[null,145,505.88,null,74.739999999999995,431.14,44413.830000000096,null,null,145,"2032-02-25",null,null,null,505.88,74.739999999999995,431.14,44413.830000000096,null,"2032-02-25",146,-505.88,"2032-02-25",145,-505.88,null,null,null,null,145,"2032-02-25",505.88,74.741616666666829,431.14,44413.830000000096,10000,"2032-02-25",146,-505.88,"2032-02-25",145,-505.88,null,null,null,"","","","","",48269,null,false,null,145,"2032-02-25",505.88,74.755802946957161,431.12419705304285,44413.07350677756]
[null,146,505.88,null,74.02,431.86,43981.970000000096,null,null,146,"2032-03-25",null,null,null,505.88,74.02,431.86,43981.970000000096,null,"2032-03-25",147,-505.88,"2032-03-25",146,-505.88,null,null,null,null,146,"2032-03-25",505.88,74.023050000000168,431.86,43981.970000000096,10000,"2032-03-25",147,-505.88,"2032-03-25",146,-505.88,null,null,null,"","","","","",48298,null,false,null,146,"2032-03-25",505.88,74.037113859610415,431.84288614038957,43981.230620637172]
[null,147,505.88,null,73.3,432.58,43549.390000000094,null,null,147,"2032-04-25",null,null,null,505.88,73.3,432.58,43549.390000000094,null,"2032-04-25",148,-505.88,"2032-04-25",147,-505.88,null,null,null,null,147,"2032-04-25",505.88,73.303283333333496,432.58,43549.390000000094,10000,"2032-04-25",148,-505.88,"2032-04-25",147,-505.88,null,null,null,"","","","","",48329,null,false,null,147,"2032-04-25",505.88,73.317226709135241,432.56277329086475,43548.667847346311]
[null,148,505.88,null,72.58,433.3,43116.090000000091,null,null,148,"2032-05-25",null,null,null,505.88,72.58,433.3,43116.090000000091,null,"2032-05-25",149,-505.88,"2032-05-25",148,-505.88,null,null,null,null,148,"2032-05-25",505.88,72.582316666666827,433.3,43116.090000000091,10000,"2032-05-25",149,-505.88,"2032-05-25",148,-505.88,null,null,null,"","","","","",48359,null,false,null,148,"2032-05-25",505.88,72.596139498346346,433.28386050165363,43115.383986844659]
[null,149,505.88,null,71.86,434.02,42682.070000000094,null,null,149,"2032-06-25",null,null,null,505.88,71.86,434.02,42682.070000000094,null,"2032-06-25",150,-505.88,"2032-06-25",149,-505.88,null,null,null,null,149,"2032-06-25",505.88,71.860150000000161,434.02,42682.070000000094,10000,"2032-06-25",150,-505.88,"2032-06-25",149,-505.88,null,null,null,"","","","","",48390,null,false,null,149,"2032-06-25",505.88,71.873850226729132,434.00614977327086,42681.377837071392]
[null,150,505.88,null,71.14,434.74,42247.330000000096,null,null,150,"2032-07-25",null,null,null,505.88,71.14,434.74,42247.330000000096,null,"2032-07-25",151,-505.88,"2032-07-25",150,-505.88,null,null,null,null,150,"2032-07-25",505.88,71.136783333333497,434.74,42247.330000000096,10000,"2032-07-25",151,-505.88,"2032-07-25",150,-505.88,null,null,null,"","","","","",48420,null,false,null,150,"2032-07-25",505.88,71.150356890434111,434.72964310956587,42246.648193961824]
[null,151,505.88,null,70.41,435.47,41811.860000000095,null,null,151,"2032-08-25",null,null,null,505.88,70.41,435.47,41811.860000000095,null,"2032-08-25",152,-505.88,"2032-08-25",151,-505.88,null,null,null,null,151,"2032-08-25",505.88,70.412216666666822,435.47,41811.860000000095,10000,"2032-08-25",152,-505.88,"2032-08-25",151,-505.88,null,null,null,"","","","","",48451,null,false,null,151,"2032-08-25",505.88,70.425657482271347,435.45434251772866,41811.193851444099]
[null,152,505.88,null,69.69,436.19,41375.670000000093,null,null,152,"2032-09-25",null,null,null,505.88,69.69,436.19,41375.670000000093,null,"2032-09-25",153,-505.88,"2032-09-25",152,-505.88,null,null,null,null,152,"2032-09-25",505.88,69.686433333333497,436.19,41375.670000000093,10000,"2032-09-25",153,-505.88,"2032-09-25",152,-505.88,null,null,null,"","","","","",48482,null,false,null,152,"2032-09-25",505.88,69.699749991704934,436.18025000829505,41375.013601435807]
[null,153,505.88,null,68.959999999999994,436.92,40938.750000000095,null,null,153,"2032-10-25",null,null,null,505.88,68.959999999999994,436.92,40938.750000000095,null,"2032-10-25",154,-505.88,"2032-10-25",153,-505.88,null,null,null,null,153,"2032-10-25",505.88,68.95945000000016,436.92,40938.750000000095,10000,"2032-10-25",154,-505.88,"2032-10-25",153,-505.88,null,null,null,"","","","","",48512,null,false,null,153,"2032-10-25",505.88,68.972632404847332,436.90736759515266,40938.106233840655]
[null,154,505.88,null,68.23,437.65,40501.100000000093,null,null,154,"2032-11-25",null,null,null,505.88,68.23,437.65,40501.100000000093,null,"2032-11-25",155,-505.88,"2032-11-25",154,-505.88,null,null,null,null,154,"2032-11-25",505.88,68.231250000000159,437.65,40501.100000000093,10000,"2032-11-25",155,-505.88,"2032-11-25",154,-505.88,null,null,null,"","","","","",48543,null,false,null,154,"2032-11-25",505.88,68.244302704453858,437.63569729554615,40500.470536545108]
[null,155,505.88,null,67.5,438.38,40062.720000000096,null,null,155,"2032-12-25",null,null,null,505.88,67.5,438.38,40062.720000000096,null,"2032-12-25",156,-505.88,"2032-12-25",155,-505.88,null,null,null,null,155,"2032-12-25",505.88,67.501833333333494,438.38,40062.720000000096,10000,"2032-12-25",156,-505.88,"2032-12-25",155,-505.88,null,null,null,"","","","","",48573,null,false,null,155,"2032-12-25",505.88,67.514758869917031,438.36524113008295,40062.105295415022]
[null,156,505.88,null,66.77,439.11,39623.610000000095,null,null,156,"2033-01-25",null,null,null,505.88,66.77,439.11,39623.610000000095,null,"2033-01-25",157,-505.88,"2033-01-25",156,-505.88,null,null,null,null,156,"2033-01-25",505.88,66.771200000000164,439.11,39623.610000000095,10000,"2033-01-25",157,-505.88,"2033-01-25",156,-505.88,null,null,null,"","","","","",48604,null,false,null,156,"2033-01-25",505.88,66.783998877261013,439.09600112273898,39623.009294292286]
[null,157,505.88,null,66.040000000000006,439.84,39183.770000000099,null,null,157,"2033-02-25",null,null,null,505.88,66.040000000000006,439.84,39183.770000000099,null,"2033-02-25",158,-505.88,"2033-02-25",157,-505.88,null,null,null,null,157,"2033-02-25",505.88,66.039350000000169,439.84,39183.770000000099,10000,"2033-02-25",158,-505.88,"2033-02-25",157,-505.88,null,null,null,"","","","","",48635,null,false,null,157,"2033-02-25",505.88,66.052020699135994,439.827979300864,39183.181314991423]
[null,158,505.88,null,65.31,440.57,38743.200000000099,null,null,158,"2033-03-25",null,null,null,505.88,65.31,440.57,38743.200000000099,null,"2033-03-25",159,-505.88,"2033-03-25",158,-505.88,null,null,null,null,158,"2033-03-25",505.88,65.306283333333496,440.57,38743.200000000099,10000,"2033-03-25",159,-505.88,"2033-03-25",158,-505.88,null,null,null,"","","","","",48663,null,false,null,158,"2033-03-25",505.88,65.318822304812514,440.5611776951875,38742.620137296239]
[null,159,505.88,null,64.569999999999993,441.31,38301.890000000101,null,null,159,"2033-04-25",null,null,null,505.88,64.569999999999993,441.31,38301.890000000101,null,"2033-04-25",160,-505.88,"2033-04-25",159,-505.88,null,null,null,null,159,"2033-04-25",505.88,64.572000000000159,441.31,38301.890000000101,10000,"2033-04-25",160,-505.88,"2033-04-25",159,-505.88,null,null,null,"","","","","",48694,null,false,null,159,"2033-04-25",505.88,64.584401660175857,441.29559833982415,38301.324538956418]
[null,160,505.88,null,63.84,442.03999999999996,37859.8500000001,null,null,160,"2033-05-25",null,null,null,505.88,63.84,442.03999999999996,37859.8500000001,null,"2033-05-25",161,-505.88,"2033-05-25",160,-505.88,null,null,null,null,160,"2033-05-25",505.88,63.836483333333497,442.03999999999996,37859.8500000001,10000,"2033-05-25",161,-505.88,"2033-05-25",160,-505.88,null,null,null,"","","","","",48724,null,false,null,160,"2033-05-25",505.88,63.848756727720456,442.03124327227954,37859.29329568414]
[null,161,505.88,null,63.1,442.78,37417.070000000102,null,null,161,"2033-06-25",null,null,null,505.88,63.1,442.78,37417.070000000102,null,"2033-06-25",162,-505.88,"2033-06-25",161,-505.88,null,null,null,null,161,"2033-06-25",505.88,63.099750000000171,442.78,37417.070000000102,10000,"2033-06-25",162,-505.88,"2033-06-25",161,-505.88,null,null,null,"","","","","",48755,null,false,null,161,"2033-06-25",505.88,63.111885466544159,442.76811453345584,37416.525181150682]
[null,162,505.88,null,62.36,443.52,36973.550000000105,null,null,162,"2033-07-25",null,null,null,505.88,62.36,443.52,36973.550000000105,null,"2033-07-25",163,-505.88,"2033-07-25",162,-505.88,null,null,null,null,162,"2033-07-25",505.88,62.361783333333506,443.52,36973.550000000105,10000,"2033-07-25",163,-505.88,"2033-07-25",162,-505.88,null,null,null,"","","","","",48785,null,false,null,162,"2033-07-25",505.88,62.373785832342612,443.50621416765739,36973.018966983022]
[null,163,505.88,null,61.62,444.26,36529.290000000103,null,null,163,"2033-08-25",null,null,null,505.88,61.62,444.26,36529.290000000103,null,"2033-08-25",164,-505.88,"2033-08-25",163,-505.88,null,null,null,null,163,"2033-08-25",505.88,61.622583333333516,444.26,36529.290000000103,10000,"2033-08-25",164,-505.88,"2033-08-25",163,-505.88,null,null,null,"","","","","",48816,null,false,null,163,"2033-08-25",505.88,61.634455777403616,444.24554422259638,36528.773422760423]
[null,164,505.88,null,60.88,445,36084.290000000103,null,null,164,"2033-09-25",null,null,null,505.88,60.88,445,36084.290000000103,null,"2033-09-25",165,-505.88,"2033-09-25",164,-505.88,null,null,null,null,164,"2033-09-25",505.88,60.882150000000173,445,36084.290000000103,10000,"2033-09-25",165,-505.88,"2033-09-25",164,-505.88,null,null,null,"","","","","",48847,null,false,null,164,"2033-09-25",505.88,60.893893250601366,444.98610674939863,36083.787316011025]
[null,165,505.88,null,60.14,445.74,35638.550000000105,null,null,165,"2033-10-25",null,null,null,505.88,60.14,445.74,35638.550000000105,null,"2033-10-25",166,-505.88,"2033-10-25",165,-505.88,null,null,null,null,165,"2033-10-25",505.88,60.140483333333499,445.74,35638.550000000105,10000,"2033-10-25",166,-505.88,"2033-10-25",165,-505.88,null,null,null,"","","","","",48877,null,false,null,165,"2033-10-25",505.88,60.152096197390847,445.72790380260915,35638.059412208415]
[null,166,505.88,null,59.4,446.48,35192.070000000102,null,null,166,"2033-11-25",null,null,null,505.88,59.4,446.48,35192.070000000102,null,"2033-11-25",167,-505.88,"2033-11-25",166,-505.88,null,null,null,null,166,"2033-11-25",505.88,59.397583333333507,446.48,35192.070000000102,10000,"2033-11-25",167,-505.88,"2033-11-25",166,-505.88,null,null,null,"","","","","",48908,null,false,null,166,"2033-11-25",505.88,59.409062559802045,446.47093744019793,35191.588474768214]
[null,167,505.88,null,58.65,447.23,34744.840000000098,null,null,167,"2033-12-25",null,null,null,505.88,58.65,447.23,34744.840000000098,null,"2033-12-25",168,-505.88,"2033-12-25",167,-505.88,null,null,null,null,167,"2033-12-25",505.88,58.65345000000017,447.23,34744.840000000098,10000,"2033-12-25",168,-505.88,"2033-12-25",167,-505.88,null,null,null,"","","","","",48938,null,false,null,167,"2033-12-25",505.88,58.664790276434339,447.21520972356564,34744.373265044647]
[null,168,505.88,null,57.91,447.97,34296.870000000097,null,null,168,"2034-01-25",null,null,null,505.88,57.91,447.97,34296.870000000097,null,"2034-01-25",169,-505.88,"2034-01-25",168,-505.88,null,null,null,null,168,"2034-01-25",505.88,57.908066666666834,447.97,34296.870000000097,10000,"2034-01-25",169,-505.88,"2034-01-25",168,-505.88,null,null,null,"","","","","",48969,null,false,null,168,"2034-01-25",505.88,57.919277282450707,447.96072271754929,34296.412542327096]
[null,169,505.88,null,57.16,448.72,33848.150000000096,null,null,169,"2034-02-25",null,null,null,505.88,57.16,448.72,33848.150000000096,null,"2034-02-25",170,-505.88,"2034-02-25",169,-505.88,null,null,null,null,169,"2034-02-25",505.88,57.161450000000166,448.72,33848.150000000096,10000,"2034-02-25",170,-505.88,"2034-02-25",169,-505.88,null,null,null,"","","","","",49000,null,{"$f":"IF($B186=$C$7,IF(AND($A$7=0,$B186>$C$7),0,IF(AND($A$7=0,$D186=0),$C185,IF(AND($A$7=0,$B186=$B$13),ROUNDDOWN($F186+$E186,2),IF($B186>$B$13,0,IF(AND($A$7=0,$D186<>0),$D186,IF($B186>$B$13,0,IF($B186=$B$13,ROUNDDOWN($F186+$E186,2),ROUND(-PMT($E$13/12,$B$13,$C$13,0,0),2)))))))))","v":false},null,169,"2034-02-25",505.88,57.172521509571993,448.707478490428,33847.705063836671]
[null,170,505.88,null,56.41,449.47,33398.680000000095,null,null,170,"2034-03-25",null,null,null,505.88,56.41,449.47,33398.680000000095,null,"2034-03-25",171,-505.88,"2034-03-25",170,-505.88,null,null,null,null,170,"2034-03-25",505.88,56.413583333333492,449.47,33398.680000000095,10000,"2034-03-25",171,-505.88,"2034-03-25",170,-505.88,null,null,null,"","","","","",49028,null,false,null,170,"2034-03-25",505.88,56.424520886071242,449.45547911392873,33398.24958472274]
[null,171,505.88,null,55.66,450.22,32948.460000000094,null,null,171,"2034-04-25",null,null,null,505.88,55.66,450.22,32948.460000000094,null,"2034-04-25",172,-505.88,"2034-04-25",171,-505.88,null,null,null,null,171,"2034-04-25",505.88,55.664466666666833,450.22,32948.460000000094,10000,"2034-04-25",172,-505.88,"2034-04-25",171,-505.88,null,null,null,"","","","","",49059,null,false,null,171,"2034-04-25",505.88,55.675273336767866,450.20472666323212,32948.044858059511]
[null,172,505.88,null,54.91,450.97,32497.490000000093,null,null,172,"2034-05-25",null,null,null,505.88,54.91,450.97,32497.490000000093,null,"2034-05-25",173,-505.88,"2034-05-25",172,-505.88,null,null,null,null,172,"2034-05-25",505.88,54.914100000000161,450.97,32497.490000000093,10000,"2034-05-25",173,-505.88,"2034-05-25",172,-505.88,null,null,null,"","","","","",49089,null,false,null,172,"2034-05-25",505.88,54.924776783021962,450.95522321697803,32497.089634842534]
[null,173,505.88,null,54.16,451.72,32045.770000000091,null,null,173,"2034-06-25",null,null,null,505.88,54.16,451.72,32045.770000000091,null,"2034-06-25",174,-505.88,"2034-06-25",173,-505.88,null,null,null,null,173,"2034-06-25",505.88,54.162483333333491,451.72,32045.770000000091,10000,"2034-06-25",174,-505.88,"2034-06-25",173,-505.88,null,null,null,"","","","","",49120,null,false,null,173,"2034-06-25",505.88,54.173029142728467,451.70697085727153,32045.382663985263]
[null,174,505.88,null,53.41,452.47,31593.30000000009,null,null,174,"2034-07-25",null,null,null,505.88,53.41,452.47,31593.30000000009,null,"2034-07-25",175,-505.88,"2034-07-25",174,-505.88,null,null,null,null,174,"2034-07-25",505.88,53.409616666666814,452.47,31593.30000000009,10000,"2034-07-25",175,-505.88,"2034-07-25",174,-505.88,null,null,null,"","","","","",49150,null,false,null,174,"2034-07-25",505.88,53.42002833031146,452.45997166968851,31592.922692315573]
[null,175,505.88,null,52.66,453.22,31140.080000000089,null,null,175,"2034-08-25",null,null,null,505.88,52.66,453.22,31140.080000000089,null,"2034-08-25",176,-505.88,"2034-08-25",175,-505.88,null,null,null,null,175,"2034-08-25",505.88,52.655500000000153,453.22,31140.080000000089,10000,"2034-08-25",176,-505.88,"2034-08-25",175,-505.88,null,null,null,"","","","","",49181,null,false,null,175,"2034-08-25",505.88,52.665772256718334,453.21422774328164,31139.70846457229]
[null,176,505.88,null,51.9,453.98,30686.100000000089,null,null,176,"2034-09-25",null,null,null,505.88,51.9,453.98,30686.100000000089,null,"2034-09-25",177,-505.88,"2034-09-25",176,-505.88,null,null,null,null,176,"2034-09-25",505.88,51.900133333333486,453.98,30686.100000000089,10000,"2034-09-25",177,-505.88,"2034-09-25",176,-505.88,null,null,null,"","","","","",49212,null,false,null,176,"2034-09-25",505.88,51.910258829414005,453.96974117058596,30685.738723401704]
[null,177,505.88,null,51.14,454.74,30231.360000000088,null,null,177,"2034-10-25",null,null,null,505.88,51.14,454.74,30231.360000000088,null,"2034-10-25",178,-505.88,"2034-10-25",177,-505.88,null,null,null,null,177,"2034-10-25",505.88,51.143500000000152,454.74,30231.360000000088,10000,"2034-10-25",178,-505.88,"2034-10-25",177,-505.88,null,null,null,"","","","","",49242,null,false,null,177,"2034-10-25",505.88,51.153485952375092,454.7265140476249,30231.012209354078]
[null,178,505.88,null,50.39,455.49,29775.870000000086,null,null,178,"2034-11-25",null,null,null,505.88,50.39,455.49,29775.870000000086,null,"2034-11-25",179,-505.88,"2034-11-25",178,-505.88,null,null,null,null,178,"2034-11-25",505.88,50.385600000000146,455.49,29775.870000000086,10000,"2034-11-25",179,-505.88,"2034-11-25",178,-505.88,null,null,null,"","","","","",49273,null,false,null,178,"2034-11-25",505.88,50.395451526084145,455.48454847391588,29775.527660880161]
[null,179,505.88,null,49.63,456.25,29319.620000000086,null,null,179,"2034-12-25",null,null,null,505.88,49.63,456.25,29319.620000000086,null,"2034-12-25",180,-505.88,"2034-12-25",179,-505.88,null,null,null,null,179,"2034-12-25",505.88,49.626450000000148,456.25,29319.620000000086,10000,"2034-12-25",180,-505.88,"2034-12-25",179,-505.88,null,null,null,"","","","","",49303,null,false,null,179,"2034-12-25",505.88,49.636153447523782,456.24384655247621,29319.283814327686]
[null,180,505.88,null,48.87,457.01,28862.610000000088,null,null,180,"2035-01-25",null,null,null,505.88,48.87,457.01,28862.610000000088,null,"2035-01-25",181,-505.88,"2035-01-25",180,-505.88,null,null,null,null,180,"2035-01-25",505.88,48.866033333333483,457.01,28862.610000000088,10000,"2035-01-25",181,-505.88,"2035-01-25",180,-505.88,null,null,null,"","","","","",49334,null,false,null,180,"2035-01-25",505.88,48.875589610170856,457.00441038982916,28862.279403937857]
[null,181,505.88,null,48.1,{"$f":"IF(B198>$B$13,0,IF(B198=$B$13,G197,C198-E198))","v":457.78},{"$f":"IF(B198>$B$13,0,G197-F198)","v":28404.830000000089},null,null,181,"2035-02-25",null,null,null,505.88,48.1,457.78,28404.830000000089,null,"2035-02-25",182,-505.88,"2035-02-25",181,-505.88,null,null,null,null,181,"2035-02-25",505.88,48.104350000000146,457.78,28404.830000000089,10000,"2035-02-25",182,-505.88,"2035-02-25",181,-505.88,null,null,null,"","","","","",49365,null,false,null,181,"2035-02-25",505.88,48.113757903990631,457.76624209600936,28404.513161841849]
[null,182,505.88,null,47.34,{"$f":"IF(B199>$B$13,0,IF(B199=$B$13,G198,C199-E199))","v":458.53999999999996},{"$f":"IF(B199>$B$13,0,G198-F199)","v":27946.290000000088},null,null,182,"2035-03-25",null,null,null,505.88,47.34,458.53999999999996,27946.290000000088,null,"2035-03-25",183,-505.88,"2035-03-25",182,-505.88,null,null,null,null,182,"2035-03-25",505.88,47.341383333333482,458.53999999999996,27946.290000000088,10000,"2035-03-25",183,-505.88,"2035-03-25",182,-505.88,null,null,null,"","","","","",49393,null,false,null,182,"2035-03-25",505.88,47.350656215430938,458.52934378456905,27945.983818057281]
[null,183,505.88,null,46.58,459.3,27486.990000000089,null,null,183,"2035-04-25",null,null,null,505.88,46.58,459.3,27486.990000000089,null,"2035-04-25",184,-505.88,"2035-04-25",183,-505.88,null,null,null,null,183,"2035-04-25",505.88,46.577150000000152,459.3,27486.990000000089,10000,"2035-04-25",184,-505.88,"2035-04-25",183,-505.88,null,null,null,"","","","","",49424,null,false,null,183,"2035-04-25",505.88,46.586282427416243,459.29371757258377,27486.690100484695]
[null,184,505.88,null,45.81,460.07,27026.920000000089,null,null,184,"2035-05-25",null,null,null,505.88,45.81,460.07,27026.920000000089,null,"2035-05-25",185,-505.88,"2035-05-25",184,-505.88,null,null,null,null,184,"2035-05-25",505.88,45.811650000000149,460.07,27026.920000000089,10000,"2035-05-25",185,-505.88,"2035-05-25",184,-505.88,null,null,null,"","","","","",49454,null,false,null,184,"2035-05-25",505.88,45.820634419341864,460.05936558065815,27026.630734904036]
[null,185,505.88,null,45.04,460.84,26566.080000000089,null,null,185,"2035-06-25",null,null,null,505.88,45.04,460.84,26566.080000000089,null,"2035-06-25",186,-505.88,"2035-06-25",185,-505.88,null,null,null,null,185,"2035-06-25",505.88,45.04486666666682,460.84,26566.080000000089,10000,"2035-06-25",186,-505.88,"2035-06-25",185,-505.88,null,null,null,"","","","","",49485,null,false,null,185,"2035-06-25",505.88,45.053710067068032,460.82628993293196,26565.804444971105]
[null,186,505.88,null,44.28,461.6,26104.480000000091,null,null,186,"2035-07-25",null,null,null,505.88,44.28,461.6,26104.480000000091,null,"2035-07-25",187,-505.88,"2035-07-25",186,-505.88,null,null,null,null,186,"2035-07-25",505.88,44.276800000000151,461.6,26104.480000000091,10000,"2035-07-25",187,-505.88,"2035-07-25",186,-505.88,null,null,null,"","","","","",49515,null,false,null,186,"2035-07-25",505.88,44.285507242914015,461.59449275708596,26104.20995221402]
[null,187,505.88,null,43.51,462.37,25642.110000000092,null,null,187,"2035-08-25",null,null,null,505.88,43.51,462.37,25642.110000000092,null,"2035-08-25",188,-505.88,"2035-08-25",187,-505.88,null,null,null,null,187,"2035-08-25",505.88,43.507466666666822,462.37,25642.110000000092,10000,"2035-08-25",188,-505.88,"2035-08-25",187,-505.88,null,null,null,"","","","","",49546,null,false,null,187,"2035-08-25",505.88,43.516023815652211,462.36397618434779,25641.845976029672]
[null,188,505.88,null,42.74,463.14,25178.970000000092,null,null,188,"2035-09-25",null,null,null,505.88,42.74,463.14,25178.970000000092,null,"2035-09-25",189,-505.88,"2035-09-25",188,-505.88,null,null,null,null,188,"2035-09-25",505.88,42.736850000000153,463.14,25178.970000000092,10000,"2035-09-25",189,-505.88,"2035-09-25",188,-505.88,null,null,null,"","","","","",49577,null,false,null,188,"2035-09-25",505.88,42.745257650502246,463.13474234949774,25178.711233680173]
[null,189,505.88,null,41.96,463.92,24715.050000000094,null,null,189,"2035-10-25",null,null,null,505.88,41.96,463.92,24715.050000000094,null,"2035-10-25",190,-505.88,"2035-10-25",189,-505.88,null,null,null,null,189,"2035-10-25",505.88,41.964950000000151,463.92,24715.050000000094,10000,"2035-10-25",190,-505.88,"2035-10-25",189,-505.88,null,null,null,"","","","","",49607,null,false,null,189,"2035-10-25",505.88,41.973206609125015,463.90679339087501,24714.804440289299]
[null,190,505.88,null,41.19,464.69,24250.360000000095,null,null,190,"2035-11-25",null,null,null,505.88,41.19,464.69,24250.360000000095,null,"2035-11-25",191,-505.88,"2035-11-25",190,-505.88,null,null,null,null,190,"2035-11-25",505.88,41.191750000000155,464.69,24250.360000000095,10000,"2035-11-25",191,-505.88,"2035-11-25",190,-505.88,null,null,null,"","","","","",49638,null,false,null,190,"2035-11-25",505.88,41.199868549616802,464.68013145038321,24250.124308838916]
[null,191,505.88,null,40.42,465.46,23784.900000000096,null,null,191,"2035-12-25",null,null,null,505.88,40.42,465.46,23784.900000000096,null,"2035-12-25",192,-505.88,"2035-12-25",191,-505.88,null,null,null,null,{"$f":"J208","v":191},{"$f":"K208","v":"2035-12-25"},505.88,40.417266666666826,465.46,23784.900000000096,10000,{"$f":"T208","v":"2035-12-25"},{"$f":"U208","v":192},-505.88,"2035-12-25",191,-505.88,null,null,null,"","","","","",49668,null,false,null,{"$f":"AD208","v":191},{"$f":"AE208","v":"2035-12-25"},505.88,40.425241326503304,465.45475867349671,23784.669550165421]
[null,192,505.88,null,39.64,466.24,23318.660000000094,null,null,192,"2036-01-25",null,null,null,505.88,39.64,466.24,23318.660000000094,null,"2036-01-25",193,-505.88,"2036-01-25",192,-505.88,null,null,null,null,192,"2036-01-25",505.88,39.641500000000157,466.24,23318.660000000094,{"$f":"IF(AD209<>$C$7,10000,AI579)","v":10000},"2036-01-25",193,-505.88,"2036-01-25",192,-505.88,null,null,null,"","","","","",49699,null,false,null,192,"2036-01-25",505.88,39.649322790733692,466.23067720926633,23318.438872956154]
[null,193,505.88,null,38.86,467.02,22851.640000000094,null,null,193,"2036-02-25",null,null,null,505.88,38.86,467.02,22851.640000000094,null,{"$f":"EDATE(T209,1)","v":"2036-02-25"},194,{"$f":"IF(U210>$V$11,0,IF($H$7=1,-O211,-O210))","v":-505.88},"2036-02-25",193,{"$f":"IF(X210>$Y$11,0,IF($H$7=1,-O210,V210))","v":-505.88},null,null,null,null,193,"2036-02-25",505.88,38.864433333333487,467.02,22851.640000000094,10000,"2036-02-25",194,{"$f":"IF(AL210>$V$11,0,IF($H$7=1,-AF211,-AF210))","v":-505.88},"2036-02-25",193,{"$f":"IF(AO210>$Y$11,0,IF($H$7=1,-AF210,AM210))","v":-505.88},null,null,null,{"$f":"IF($B210=$C$7,B210,\"\")","v":""},{"$f":"IF($B210=$C$7,C210,\"\")","v":""},{"$f":"IF($B210=$C$7,E210,\"\")","v":""},{"$f":"IF($B210=$C$7,F210,\"\")","v":""},{"$f":"IF($B210=$C$7,G210,\"\")","v":""},{"$f":"K210","v":49730},null,false,null,193,"2036-02-25",505.88,38.872110789674629,467.00788921032535,22851.430983745828]
[null,194,{"$f":"IF(AND($A$7=0,$B211>$C$7),0,IF(AND($A$7=0,$B211=$C$7),ROUND(($F211+$E211),2),IF(AND($A$7=0,$D211=0),ROUND($C210,2),IF(AND($A$7=0,$B211=$B$13),ROUND($F211+$E211,2),IF($B211>$B$13,0,IF(AND($A$7=0,$D211<>0),ROUND($D211,2),IF($B211>$B$13,0,IF($B211=$B$13,ROUND($F211+$E211,2),ROUND(-PMT($E$13/12,$B$13,$C$13,0,0),2)))))))))","v":505.88},null,{"$f":"IF(B211>$B$13,0,ROUND(G210*$E$13/12,2))","v":38.090000000000003},467.78999999999996,22383.850000000093,null,null,194,"2036-03-25",null,null,null,505.88,38.090000000000003,{"$f":"IF($P$7=\"Oui\",O211-P211,F211)","v":467.78999999999996},{"$f":"IF(J211>$B$13,0,R210-Q211)","v":22383.850000000093},null,"2036-03-25",195,-505.88,{"$f":"EDATE(W210,1)","v":"2036-03-25"},194,-505.88,null,null,null,null,194,"2036-03-25",505.88,38.086066666666824,467.78999999999996,{"$f":"AI210-AH211","v":22383.850000000093},10000,"2036-03-25",195,-505.88,{"$f":"EDATE(AN210,1)","v":"2036-03-25"},194,-505.88,null,null,null,"","","","","",49759,null,false,null,194,"2036-03-25",505.88,38.093603167104334,467.78639683289566,{"$f":"BH210-BG211","v":22383.644586912931}]
[null,195,505.88,null,37.31,468.57,21915.280000000093,null,null,195,{"$f":"EDATE(K211,1)","v":"2036-04-25"},null,null,null,{"$f":"IF(J212>$C$7,0,IF($P$7=\"Oui\",IF(J212=$C$7,ROUND(Q212+P212,2),$AE$14),ROUND(C212,2)))","v":505.88},{"$f":"IF($P$7=\"Oui\",R211*$E$7/12,ROUND(R211*$E$7/12,2))","v":37.31},468.57,21915.280000000093,null,"2036-04-25",196,-505.88,"2036-04-25",195,-505.88,null,null,null,null,195,"2036-04-25",{"$f":"IF(AD212>$C$7,0,IF($P$7=\"Oui\",IF(AD212=$C$7,AH212+AG212,$AE$14),O212))","v":505.88},{"$f":"IF($P$7=\"Oui\",AI211*$AF$13/12,AI211*$E$7/12)","v":37.306416666666827},{"$f":"IF($P$7=\"Oui\",IF(AD212=$C$7,AI211,AF212-AG212),Q212)","v":468.57},21915.280000000093,10000,"2036-04-25",196,-505.88,"2036-04-25",195,-505.88,null,null,null,"","","","","",49790,null,false,null,195,"2036-04-25",505.88,{"$f":"BH211*$BE$13/12","v":37.313797763206558},468.56620223679346,21915.078384676137]
[null,196,505.88,null,36.53,469.35,21445.930000000095,null,null,196,"2036-05-25",null,null,null,505.88,36.53,469.35,21445.930000000095,null,"2036-05-25",197,-505.88,"2036-05-25",196,-505.88,null,null,null,null,196,"2036-05-25",505.88,36.525466666666823,469.35,21445.930000000095,10000,"2036-05-25",197,-505.88,"2036-05-25",196,-505.88,null,null,null,"","","","","",49820,null,false,null,196,"2036-05-25",505.88,36.532692414564643,469.34730758543537,21445.731077090702]
[null,197,505.88,null,35.74,470.14,20975.790000000095,null,null,197,"2036-06-25",null,null,null,505.88,35.74,470.14,20975.790000000095,null,"2036-06-25",198,-505.88,"2036-06-25",197,-505.88,null,null,null,null,197,"2036-06-25",505.88,35.743216666666825,470.14,20975.790000000095,10000,"2036-06-25",198,-505.88,"2036-06-25",197,-505.88,null,null,null,"","","","","",49851,null,false,null,197,"2036-06-25",505.88,35.750284954155454,470.12971504584453,20975.601362044858]
[null,198,505.88,null,34.96,470.92,20504.870000000097,null,null,198,"2036-07-25",null,null,null,505.88,34.96,470.92,20504.870000000097,null,"2036-07-25",199,-505.88,"2036-07-25",198,-505.88,null,null,null,null,198,"2036-07-25",505.88,34.95965000000016,470.92,20504.870000000097,10000,"2036-07-25",199,-505.88,"2036-07-25",198,-505.88,null,null,null,"","","","","",49881,null,false,null,198,"2036-07-25",505.88,34.966573211343423,470.91342678865658,20504.687935256203]
[null,199,505.88,null,34.17,471.71,20033.160000000098,null,null,199,"2036-08-25",null,null,null,505.88,34.17,471.71,20033.160000000098,null,"2036-08-25",200,-505.88,"2036-08-25",199,-505.88,null,null,null,null,199,"2036-08-25",505.88,34.174783333333494,471.71,20033.160000000098,10000,"2036-08-25",200,-505.88,"2036-08-25",199,-505.88,null,null,null,"","","","","",49912,null,false,null,199,"2036-08-25",{"$f":"AF216","v":505.88},34.181555011874515,{"$f":"IF(BC216=$C$7,BH215,BE216-BF216)","v":471.69844498812546},20032.989490268079]
[null,200,505.88,null,33.39,472.49,19560.670000000096,null,null,200,"2036-09-25",null,null,null,505.88,33.39,472.49,19560.670000000096,null,"2036-09-25",201,-505.88,"2036-09-25",200,-505.88,null,null,null,null,200,"2036-09-25",505.88,33.38860000000016,472.49,19560.670000000096,10000,"2036-09-25",201,-505.88,"2036-09-25",200,-505.88,null,null,null,"","","","","",49943,null,false,null,200,"2036-09-25",505.88,33.395228177870159,472.48477182212986,19560.504718445951]
[null,201,505.88,null,32.6,473.28,19087.390000000098,null,null,201,"2036-10-25",null,null,null,505.88,32.6,473.28,19087.390000000098,null,"2036-10-25",202,-505.88,"2036-10-25",201,-505.88,null,null,null,null,201,"2036-10-25",505.88,32.601116666666826,473.28,19087.390000000098,10000,"2036-10-25",202,-505.88,"2036-10-25",201,-505.88,null,null,null,"","","","","",49973,null,false,null,201,"2036-10-25",505.88,32.607590527821266,473.27240947217871,19087.232308973773]
[null,202,505.88,null,31.81,474.07,18613.320000000098,null,null,202,"2036-11-25",null,null,null,505.88,31.81,474.07,18613.320000000098,null,"2036-11-25",203,-505.88,"2036-11-25",202,-505.88,null,null,null,null,202,"2036-11-25",505.88,31.812316666666831,474.07,18613.320000000098,10000,"2036-11-25",203,-505.88,"2036-11-25",202,-505.88,null,null,null,"","","","","",50004,null,false,null,202,"2036-11-25",505.88,31.818639876582129,474.06136012341784,18613.170948850355]
[null,203,505.88,null,31.02,474.86,18138.460000000097,null,null,203,"2036-12-25",null,null,null,505.88,31.02,474.86,18138.460000000097,null,"2036-12-25",204,-505.88,"2036-12-25",203,-505.88,null,null,null,null,203,"2036-12-25",505.88,31.022200000000165,474.86,18138.460000000097,10000,"2036-12-25",204,-505.88,"2036-12-25",203,-505.88,null,null,null,"","","","","",50034,null,false,null,203,"2036-12-25",505.88,31.028374035364383,474.85162596463562,18138.31932288572]
[null,204,505.88,null,30.23,475.65,17662.810000000096,null,null,204,"2037-01-25",null,null,null,505.88,30.23,475.65,17662.810000000096,null,"2037-01-25",205,-505.88,"2037-01-25",204,-505.88,null,null,null,null,204,"2037-01-25",505.88,30.230766666666828,475.65,17662.810000000096,10000,"2037-01-25",205,-505.88,"2037-01-25",204,-505.88,null,null,null,"","","","","",50065,null,false,null,204,"2037-01-25",505.88,30.236790811730923,475.64320918826905,17662.676113697449]
[null,205,505.88,null,29.44,476.44,17186.370000000097,null,null,205,"2037-02-25",null,null,null,505.88,29.44,476.44,17186.370000000097,null,"2037-02-25",206,-505.88,"2037-02-25",205,-505.88,null,null,null,null,205,"2037-02-25",505.88,29.438016666666826,476.44,17186.370000000097,10000,"2037-02-25",206,-505.88,"2037-02-25",205,-505.88,null,null,null,"","","","","",50096,null,false,null,205,"2037-02-25",505.88,29.443888009589823,476.43611199041015,17186.240001707039]
[null,206,505.88,null,28.64,477.24,16709.130000000096,null,null,206,"2037-03-25",null,null,null,505.88,28.64,477.24,16709.130000000096,null,"2037-03-25",207,-505.88,"2037-03-25",206,-505.88,null,null,null,null,206,"2037-03-25",505.88,28.643950000000164,477.24,16709.130000000096,10000,"2037-03-25",207,-505.88,"2037-03-25",206,-505.88,null,null,null,"","","","","",50124,null,false,null,206,"2037-03-25",505.88,28.649663429188266,477.23033657081174,16709.009665136229]
[null,207,505.88,null,27.85,478.03,16231.100000000095,null,null,207,"2037-04-25",null,null,null,505.88,27.85,478.03,16231.100000000095,null,"2037-04-25",208,-505.88,"2037-04-25",207,-505.88,null,null,null,null,207,"2037-04-25",505.88,27.848550000000159,478.03,16231.100000000095,10000,"2037-04-25",208,-505.88,"2037-04-25",207,-505.88,null,null,null,"","","","","",50155,null,false,null,207,"2037-04-25",505.88,27.854114867106393,478.02588513289362,16230.983780003335]
[null,208,505.88,null,27.05,478.83,15752.270000000095,null,null,208,"2037-05-25",null,null,null,505.88,27.05,478.83,15752.270000000095,null,"2037-05-25",209,-505.88,"2037-05-25",208,-505.88,null,null,null,null,208,"2037-05-25",505.88,27.051833333333491,478.83,15752.270000000095,10000,"2037-05-25",209,-505.88,"2037-05-25",208,-505.88,null,null,null,"","","","","",50185,null,false,null,208,"2037-05-25",505.88,27.057240116251236,478.82275988374874,15752.161020119585]
[null,209,505.88,null,26.25,479.63,15272.640000000096,null,null,209,"2037-06-25",null,null,null,505.88,26.25,479.63,15272.640000000096,null,"2037-06-25",210,-505.88,"2037-06-25",209,-505.88,null,null,null,null,209,"2037-06-25",505.88,26.253783333333491,479.63,15272.640000000096,10000,"2037-06-25",210,-505.88,"2037-06-25",209,-505.88,null,null,null,"","","","","",50216,null,false,null,209,"2037-06-25",505.88,26.259036965850573,479.62096303414944,15272.540057085436]
[null,210,505.88,null,25.45,480.43,14792.210000000096,null,null,210,"2037-07-25",null,null,null,505.88,25.45,480.43,14792.210000000096,null,"2037-07-25",211,-505.88,"2037-07-25",210,-505.88,null,null,null,null,210,"2037-07-25",505.88,25.45440000000016,480.43,14792.210000000096,10000,"2037-07-25",211,-505.88,"2037-07-25",210,-505.88,null,null,null,"","","","","",50246,null,false,null,210,"2037-07-25",505.88,25.459503201446804,480.42049679855319,14792.119560286883]
[null,211,505.88,null,24.65,481.23,14310.980000000096,null,null,211,"2037-08-25",null,null,null,505.88,24.65,481.23,14310.980000000096,null,"2037-08-25",212,-505.88,"2037-08-25",211,-505.88,null,null,null,null,211,"2037-08-25",505.88,24.653683333333493,481.23,14310.980000000096,10000,"2037-08-25",212,-505.88,"2037-08-25",211,-505.88,null,null,null,"","","","","",50277,null,false,null,211,"2037-08-25",505.88,24.658636604890788,481.22136339510922,14310.898196891774]
[null,212,505.88,null,23.85,482.03,13828.950000000095,null,null,212,"2037-09-25",null,null,null,505.88,23.85,482.03,13828.950000000095,null,"2037-09-25",213,-505.88,"2037-09-25",212,-505.88,null,null,null,null,212,"2037-09-25",505.88,23.851633333333496,482.03,13828.950000000095,10000,"2037-09-25",213,-505.88,"2037-09-25",212,-505.88,null,null,null,"","","","","",50308,null,false,null,212,"2037-09-25",505.88,23.856434954335715,482.02356504566427,13828.874631846111]
[null,213,505.88,null,23.05,482.83,13346.120000000095,null,null,213,"2037-10-25",null,null,null,505.88,23.05,482.83,13346.120000000095,null,"2037-10-25",214,-505.88,"2037-10-25",213,-505.88,null,null,null,null,213,"2037-10-25",505.88,23.048250000000163,482.83,13346.120000000095,10000,"2037-10-25",214,-505.88,"2037-10-25",213,-505.88,null,null,null,"","","","","",50338,null,false,null,213,"2037-10-25",505.88,23.052896024230932,482.82710397576909,13346.047527870342]
[null,214,505.88,null,22.24,483.64,12862.480000000096,null,null,214,"2037-11-25",null,null,null,505.88,22.24,483.64,12862.480000000096,null,"2037-11-25",215,-505.88,"2037-11-25",214,-505.88,null,null,null,null,214,"2037-11-25",505.88,22.243533333333492,483.64,12862.480000000096,10000,"2037-11-25",215,-505.88,"2037-11-25",214,-505.88,null,null,null,"","","","","",50369,null,false,null,214,"2037-11-25",505.88,22.248017585315761,483.63198241468422,12862.415545455657]
[null,215,505.88,null,21.44,484.44,12378.040000000095,null,null,215,"2037-12-25",null,null,null,505.88,21.44,484.44,12378.040000000095,null,"2037-12-25",216,-505.88,"2037-12-25",215,-505.88,null,null,null,null,215,"2037-12-25",505.88,21.437466666666825,484.44,12378.040000000095,10000,"2037-12-25",216,-505.88,"2037-12-25",215,-505.88,null,null,null,"","","","","",50399,null,false,null,215,"2037-12-25",505.88,21.441797404613315,484.43820259538666,12377.977342860269]
[null,216,505.88,null,20.63,485.25,11892.790000000095,null,null,216,"2038-01-25",null,null,null,505.88,20.63,485.25,11892.790000000095,null,"2038-01-25",217,-505.88,"2038-01-25",216,-505.88,null,null,null,null,216,"2038-01-25",505.88,20.630066666666824,485.25,11892.790000000095,10000,"2038-01-25",217,-505.88,"2038-01-25",216,-505.88,null,null,null,"","","","","",50430,null,false,null,216,"2038-01-25",505.88,20.634233245424323,485.2457667545757,11892.731576105694]
[null,217,505.88,null,19.82,486.06,11406.730000000096,null,null,217,"2038-02-25",null,null,null,505.88,19.82,486.06,11406.730000000096,null,"2038-02-25",218,-505.88,"2038-02-25",217,-505.88,null,null,null,null,217,"2038-02-25",505.88,19.821316666666828,486.06,11406.730000000096,10000,"2038-02-25",218,-505.88,"2038-02-25",217,-505.88,null,null,null,"","","","","",50461,null,false,null,217,"2038-02-25",505.88,19.825322867320903,486.0546771326791,11406.676898973015]
[null,218,505.88,null,19.010000000000002,486.87,10919.860000000095,null,null,218,"2038-03-25",null,null,null,505.88,19.010000000000002,486.87,10919.860000000095,null,"2038-03-25",219,-505.88,"2038-03-25",218,-505.88,null,null,null,null,218,"2038-03-25",505.88,19.011216666666826,486.87,10919.860000000095,10000,"2038-03-25",219,-505.88,"2038-03-25",218,-505.88,null,null,null,"","","","","",50489,null,false,null,218,"2038-03-25",505.88,19.015064026140351,486.86493597385964,10919.811962999156]
[null,219,505.88,null,18.2,487.68,10432.180000000095,null,null,219,"2038-04-25",null,null,null,505.88,18.2,487.68,10432.180000000095,null,"2038-04-25",220,-505.88,"2038-04-25",219,-505.88,null,null,null,null,219,"2038-04-25",505.88,18.199766666666825,487.68,10432.180000000095,10000,"2038-04-25",220,-505.88,"2038-04-25",219,-505.88,null,null,null,"","","","","",50520,null,false,null,219,"2038-04-25",505.88,18.203454473978919,487.67654552602107,10432.135417473135]
[null,220,505.88,null,17.39,488.49,9943.6900000000951,null,null,220,"2038-05-25",null,null,null,505.88,17.39,488.49,9943.6900000000951,null,"2038-05-25",221,-505.88,"2038-05-25",220,-505.88,null,null,null,null,220,"2038-05-25",505.88,17.386966666666826,488.49,9943.6900000000951,10000,"2038-05-25",221,-505.88,"2038-05-25",220,-505.88,null,null,null,"","","","","",50550,null,false,null,220,"2038-05-25",505.88,17.390491959185571,488.48950804081443,9943.64590943232]
[null,221,505.88,null,16.57,489.31,9454.3800000000956,null,null,221,"2038-06-25",null,null,null,505.88,16.57,489.31,9454.3800000000956,null,"2038-06-25",222,-505.88,"2038-06-25",221,-505.88,null,null,null,null,221,"2038-06-25",505.88,16.572816666666824,489.31,9454.3800000000956,10000,"2038-06-25",222,-505.88,"2038-06-25",221,-505.88,null,null,null,"","","","","",50581,null,false,null,221,"2038-06-25",505.88,16.576174226355761,489.30382577364423,9454.3420836586756]
[null,222,505.88,null,15.76,490.12,8964.2600000000948,null,null,222,"2038-07-25",null,null,null,505.88,15.76,490.12,8964.2600000000948,null,"2038-07-25",223,-505.88,"2038-07-25",222,-505.88,null,null,null,null,222,"2038-07-25",505.88,15.757300000000159,490.12,8964.2600000000948,10000,"2038-07-25",223,-505.88,"2038-07-25",222,-505.88,null,null,null,"","","","","",50611,null,false,null,222,"2038-07-25",505.88,15.760499016325136,490.11950098367487,8964.222582675]
[null,223,505.88,null,14.94,490.94,8473.3200000000943,null,null,223,"2038-08-25",null,null,null,505.88,14.94,490.94,8473.3200000000943,null,"2038-08-25",224,-505.88,"2038-08-25",223,-505.88,null,null,null,null,223,"2038-08-25",505.88,14.940433333333493,490.94,8473.3200000000943,10000,"2038-08-25",224,-505.88,"2038-08-25",223,-505.88,null,null,null,"","","","","",50642,null,false,null,223,"2038-08-25",505.88,14.943464066163306,490.93653593383669,8473.2860467411629]
[null,224,505.88,null,14.12,491.76,7981.5600000000941,null,null,224,"2038-09-25",null,null,null,505.88,14.12,491.76,7981.5600000000941,null,"2038-09-25",225,-505.88,"2038-09-25",224,-505.88,null,null,null,null,224,"2038-09-25",505.88,14.122200000000158,491.76,7981.5600000000941,10000,"2038-09-25",225,-505.88,"2038-09-25",224,-505.88,null,null,null,"","","","","",50673,null,false,null,224,"2038-09-25",505.88,14.125067109167533,491.75493289083244,7981.5311138503303]
[null,225,505.88,null,13.3,492.58,7488.9800000000942,null,null,225,"2038-10-25",null,null,null,505.88,13.3,492.58,7488.9800000000942,null,"2038-10-25",226,-505.88,"2038-10-25",225,-505.88,null,null,null,null,225,"2038-10-25",505.88,13.302600000000156,492.58,7488.9800000000942,10000,"2038-10-25",226,-505.88,"2038-10-25",225,-505.88,null,null,null,"","","","","",50703,null,false,null,225,"2038-10-25",505.88,13.305305874856478,492.57469412514354,7488.9564197251866]
[null,226,505.88,null,12.48,493.4,6995.5800000000945,null,null,226,"2038-11-25",null,null,null,505.88,12.48,493.4,6995.5800000000945,null,"2038-11-25",227,-505.88,"2038-11-25",226,-505.88,null,null,null,null,226,"2038-11-25",505.88,12.481633333333491,493.4,6995.5800000000945,10000,"2038-11-25",227,-505.88,"2038-11-25",226,-505.88,null,null,null,"","","","","",50734,null,false,null,226,"2038-11-25",505.88,12.484178088963867,493.39582191103614,6995.5605978141502]
[null,227,505.88,null,11.66,494.21999999999997,6501.3600000000943,null,null,227,"2038-12-25",null,null,null,505.88,11.66,494.21999999999997,6501.3600000000943,null,"2038-12-25",228,-505.88,"2038-12-25",227,-505.88,null,null,null,null,227,"2038-12-25",505.88,11.659300000000158,494.21999999999997,6501.3600000000943,10000,"2038-12-25",228,-505.88,"2038-12-25",227,-505.88,null,null,null,"","","","","",50764,null,false,null,227,"2038-12-25",505.88,11.661681473432205,494.21831852656777,6501.3422792875826]
[null,228,505.88,null,10.84,495.04,6006.3200000000943,null,null,228,"2039-01-25",null,null,null,505.88,10.84,495.04,6006.3200000000943,null,"2039-01-25",229,-505.88,"2039-01-25",228,-505.88,null,null,null,null,228,"2039-01-25",505.88,10.835600000000158,495.04,6006.3200000000943,10000,"2039-01-25",229,-505.88,"2039-01-25",228,-505.88,null,null,null,"","","","","",50795,null,false,null,228,"2039-01-25",505.88,10.837813746406448,495.04218625359357,6006.3000930339895]
[null,229,505.88,null,10.01,495.87,5510.4500000000944,null,null,229,"2039-02-25",null,null,null,505.88,10.01,495.87,5510.4500000000944,null,"2039-02-25",230,-505.88,"2039-02-25",229,-505.88,null,null,null,null,229,"2039-02-25",505.88,10.010533333333491,495.87,5510.4500000000944,10000,"2039-02-25",230,-505.88,"2039-02-25",229,-505.88,null,null,null,"","","","","",50826,null,false,null,229,"2039-02-25",505.88,10.012572622227671,495.86742737777234,5510.4326656562171]
[null,230,505.88,null,9.18,496.7,5013.7500000000946,null,null,230,"2039-03-25",null,null,null,505.88,9.18,496.7,5013.7500000000946,null,"2039-03-25",231,-505.88,"2039-03-25",230,-505.88,null,null,null,null,230,"2039-03-25",505.88,9.1840833333334917,496.7,5013.7500000000946,10000,"2039-03-25",231,-505.88,"2039-03-25",230,-505.88,null,null,null,"","","","","",50854,null,false,null,230,"2039-03-25",505.88,9.1859558114267301,496.69404418857329,5013.7386214676435]
[null,231,505.88,null,8.36,497.52,4516.2300000000942,null,null,231,"2039-04-25",null,null,null,505.88,8.36,497.52,4516.2300000000942,null,"2039-04-25",232,-505.88,"2039-04-25",231,-505.88,null,null,null,null,231,"2039-04-25",505.88,8.3562500000001574,497.52,4516.2300000000942,10000,"2039-04-25",232,-505.88,"2039-04-25",231,-505.88,null,null,null,"","","","","",50885,null,false,null,231,"2039-04-25",505.88,8.3579610207179087,497.52203897928212,4516.2165824883614]
[null,232,505.88,null,7.53,498.35,4017.8800000000942,null,null,232,"2039-05-25",null,null,null,505.88,7.53,498.35,4017.8800000000942,null,"2039-05-25",233,-505.88,"2039-05-25",232,-505.88,null,null,null,null,232,"2039-05-25",505.88,7.5270500000001563,498.35,4017.8800000000942,10000,"2039-05-25",233,-505.88,"2039-05-25",232,-505.88,null,null,null,"","","","","",50915,null,false,null,232,"2039-05-25",505.88,7.5285859529925574,498.35141404700744,4017.8651684413539]
[null,233,505.88,null,6.7,499.18,3518.7000000000944,null,null,233,"2039-06-25",null,null,null,505.88,6.7,499.18,3518.7000000000944,null,"2039-06-25",234,-505.88,"2039-06-25",233,-505.88,null,null,null,null,233,"2039-06-25",505.88,6.6964666666668231,499.18,3518.7000000000944,10000,"2039-06-25",234,-505.88,"2039-06-25",233,-505.88,null,null,null,"","","","","",50946,null,{"$f":"IF($B250=$C$7,IF(AND($A$7=0,$B250>$C$7),0,IF(AND($A$7=0,$D250=0),$C249,IF(AND($A$7=0,$B250=$B$13),ROUNDDOWN($F250+$E250,2),IF($B250>$B$13,0,IF(AND($A$7=0,$D250<>0),$D250,IF($B250>$B$13,0,IF($B250=$B$13,ROUNDDOWN($F250+$E250,2),ROUND(-PMT($E$13/12,$B$13,$C$13,0,0),2)))))))))","v":false},null,233,"2039-06-25",505.88,6.6978283073127187,499.18217169268729,3518.6829967486665]
[null,234,505.88,null,5.86,500.02,3018.6800000000944,null,null,234,"2039-07-25",null,null,null,505.88,5.86,500.02,3018.6800000000944,null,"2039-07-25",235,-505.88,"2039-07-25",234,-505.88,null,null,null,null,234,"2039-07-25",505.88,5.8645000000001568,500.02,3018.6800000000944,10000,"2039-07-25",235,-505.88,"2039-07-25",234,-505.88,null,null,null,"","","","","",50976,null,false,null,234,"2039-07-25",505.88,5.8656857789047443,500.01431422109528,3018.668682527571]
[null,235,505.88,null,5.03,500.85,2517.8300000000945,null,null,235,"2039-08-25",null,null,null,505.88,5.03,500.85,2517.8300000000945,null,"2039-08-25",236,-505.88,"2039-08-25",235,-505.88,null,null,null,null,235,"2039-08-25",505.88,5.0311333333334902,500.85,2517.8300000000945,10000,"2039-08-25",236,-505.88,"2039-08-25",235,-505.88,null,null,null,"","","","","",51007,null,false,null,235,"2039-08-25",505.88,5.0321560591529026,500.8478439408471,2517.8208385867238]
[null,236,505.88,null,4.2,501.68,2016.1500000000945,null,null,236,"2039-09-25",null,null,null,505.88,4.2,501.68,2016.1500000000945,null,"2039-09-25",237,-505.88,"2039-09-25",236,-505.88,null,null,null,null,236,"2039-09-25",505.88,4.1963833333334906,501.68,2016.1500000000945,10000,"2039-09-25",237,-505.88,"2039-09-25",236,-505.88,null,null,null,"","","","","",51038,null,false,null,236,"2039-09-25",505.88,4.197236835592971,501.68276316440705,2016.1380754223167]
[null,237,505.88,null,3.36,502.52,1513.6300000000945,null,null,237,"2039-10-25",null,null,null,505.88,3.36,502.52,1513.6300000000945,null,"2039-10-25",238,-505.88,"2039-10-25",237,-505.88,null,null,null,null,237,"2039-10-25",505.88,3.3602500000001574,502.52,1513.6300000000945,10000,"2039-10-25",238,-505.88,"2039-10-25",237,-505.88,null,null,null,"","","","","",51068,null,false,null,237,"2039-10-25",505.88,3.3609257919058226,502.5190742080942,1513.6190012142224]
[null,238,505.88,null,2.52,503.36,1010.2700000000945,null,null,238,"2039-11-25",null,null,null,505.88,2.52,503.36,1010.2700000000945,null,"2039-11-25",239,-505.88,"2039-11-25",238,-505.88,null,null,null,null,238,"2039-11-25",505.88,2.5227166666668244,503.36,1010.2700000000945,10000,"2039-11-25",239,-505.88,"2039-11-25",238,-505.88,null,null,null,"","","","","",51099,null,false,null,238,"2039-11-25",505.88,2.5232206079109996,503.35677939208898,1010.2622218221334]
[null,239,505.88,null,1.68,504.2,506.07000000009447,null,null,239,"2039-12-25",null,null,null,505.88,1.68,504.2,506.07000000009447,null,"2039-12-25",240,-505.88,"2039-12-25",239,-505.88,null,null,null,null,239,"2039-12-25",505.88,1.6837833333334908,504.2,506.07000000009447,10000,"2039-12-25",240,-505.88,"2039-12-25",239,-505.88,null,null,null,"","","","","",51129,null,false,null,239,"2039-12-25",505.88,1.6841189595602761,504.1958810404397,506.06634078169367]
[null,240,506.91,null,0.84,{"$f":"IF(B257>$B$13,0,IF(B257=$B$13,G256,C257-E257))","v":506.07000000009447},{"$f":"IF(B257>$B$13,0,G256-F257)","v":0},null,null,240,"2040-01-25",null,null,null,506.91,0.84,506.07000000009447,0,null,"2040-01-25",241,-506.91,"2040-01-25",240,-506.91,null,null,null,null,240,"2040-01-25",506.91,0.84345000000015746,506.07000000009447,0,{"$f":"IF(AD257<>$C$7,10000,AI627)","v":0},"2040-01-25",241,-506.91,"2040-01-25",240,-506.91,null,null,null,240,506.91,0.84,506.07000000009447,0,51160,null,506.91,null,240,"2040-01-25",506.91,0.84361851893121031,506.06634078169367,0]
[null,241,0,null,0,0,0,null,null,241,"2040-02-25",null,null,null,0,0,0,0,null,"2040-02-25",242,0,"2040-02-25",241,0,null,null,null,null,241,"2040-02-25",0,0,0,0,{"$f":"IF(AD258<>$C$7,10000,AI628)","v":10000},"2040-02-25",242,0,"2040-02-25",241,0,null,null,null,"","","","","",51191,null,false,null,241,"2040-02-25",0,0,0,0]
[null,242,0,null,0,0,0,null,null,242,"2040-03-25",null,null,null,0,0,0,0,null,"2040-03-25",243,0,"2040-03-25",242,0,null,null,null,null,242,"2040-03-25",0,0,0,0,10000,"2040-03-25",243,0,"2040-03-25",242,0,null,null,null,"","","","","",51220,null,false,null,242,"2040-03-25",0,0,0,0]
[null,243,0,null,0,0,0,null,null,243,"2040-04-25",null,null,null,0,0,0,0,null,"2040-04-25",244,0,"2040-04-25",243,0,null,null,null,null,243,"2040-04-25",0,0,0,0,10000,"2040-04-25",244,0,"2040-04-25",243,0,null,null,null,"","","","","",51251,null,false,null,243,"2040-04-25",0,0,0,0]
[null,244,0,null,0,0,0,null,null,244,"2040-05-25",null,null,null,0,0,0,0,null,"2040-05-25",245,0,"2040-05-25",244,0,null,null,null,null,244,"2040-05-25",0,0,0,0,10000,"2040-05-25",245,0,"2040-05-25",244,0,null,null,null,"","","","","",51281,null,false,null,244,"2040-05-25",0,0,0,0]
[null,245,0,null,0,0,0,null,null,245,"2040-06-25",null,null,null,0,0,0,0,null,"2040-06-25",246,0,"2040-06-25",245,0,null,null,null,null,245,"2040-06-25",0,0,0,0,10000,"2040-06-25",246,0,"2040-06-25",245,0,null,null,null,"","","","","",51312,null,false,null,245,"2040-06-25",0,0,0,0]
[null,246,0,null,0,{"$f":"IF(B263>$B$13,0,IF(B263=$B$13,G262,C263-E263))","v":0},{"$f":"IF(B263>$B$13,0,G262-F263)","v":0},null,null,246,"2040-07-25",null,null,null,0,0,0,0,null,"2040-07-25",247,0,"2040-07-25",246,0,null,null,null,null,246,"2040-07-25",0,0,0,0,10000,"2040-07-25",247,0,"2040-07-25",246,0,null,null,null,"","","","","",51342,null,false,null,246,"2040-07-25",0,0,0,0]
[null,247,0,null,0,0,0,null,null,247,"2040-08-25",null,null,null,0,0,0,0,null,"2040-08-25",248,0,"2040-08-25",247,0,null,null,null,null,247,"2040-08-25",0,0,0,0,10000,"2040-08-25",248,0,"2040-08-25",247,0,null,null,null,"","","","","",51373,null,false,null,247,"2040-08-25",0,0,0,0]
[null,248,0,null,0,0,0,null,null,248,"2040-09-25",null,null,null,0,0,0,0,null,"2040-09-25",249,0,"2040-09-25",248,0,null,null,null,null,248,"2040-09-25",0,0,0,0,10000,"2040-09-25",249,0,"2040-09-25",248,0,null,null,null,"","","","","",51404,null,false,null,248,"2040-09-25",0,0,0,0]
[null,249,0,null,0,0,0,null,null,249,"2040-10-25",null,null,null,0,0,0,0,null,"2040-10-25",250,0,"2040-10-25",249,0,null,null,null,null,249,"2040-10-25",0,0,0,0,10000,"2040-10-25",250,0,"2040-10-25",249,0,null,null,null,"","","","","",51434,null,false,null,249,"2040-10-25",0,0,0,0]
[null,250,0,null,0,0,0,null,null,250,"2040-11-25",null,null,null,0,0,0,0,null,"2040-11-25",251,0,"2040-11-25",250,0,null,null,null,null,250,"2040-11-25",0,0,0,0,10000,"2040-11-25",251,0,"2040-11-25",250,0,null,null,null,"","","","","",51465,null,false,null,250,"2040-11-25",0,0,0,0]
[null,251,0,null,0,0,0,null,null,251,"2040-12-25",null,null,null,0,0,0,0,null,"2040-12-25",252,0,"2040-12-25",251,0,null,null,null,null,251,"2040-12-25",0,0,0,0,10000,"2040-12-25",252,0,"2040-12-25",251,0,null,null,null,"","","","","",51495,null,false,null,251,"2040-12-25",0,0,0,0]
[null,252,0,null,0,0,0,null,null,252,"2041-01-25",null,null,null,0,0,0,0,null,"2041-01-25",253,0,"2041-01-25",252,0,null,null,null,null,252,"2041-01-25",0,0,0,0,10000,"2041-01-25",253,0,"2041-01-25",252,0,null,null,null,"","","","","",51526,null,false,null,252,"2041-01-25",0,0,0,0]
[null,253,0,null,0,0,0,null,null,253,"2041-02-25",null,null,null,0,0,0,0,null,"2041-02-25",254,0,"2041-02-25",253,0,null,null,null,null,253,"2041-02-25",0,0,0,0,10000,"2041-02-25",254,0,"2041-02-25",253,0,null,null,null,"","","","","",51557,null,false,null,253,"2041-02-25",0,0,0,0]
[null,254,0,null,0,0,0,null,null,254,"2041-03-25",null,null,null,0,0,0,0,null,"2041-03-25",255,0,"2041-03-25",254,0,null,null,null,null,254,"2041-03-25",0,0,0,0,10000,"2041-03-25",255,0,"2041-03-25",254,0,null,null,null,"","","","","",51585,null,false,null,254,"2041-03-25",0,0,0,0]
[null,255,0,null,0,0,0,null,null,255,"2041-04-25",null,null,null,0,0,0,0,null,"2041-04-25",256,0,"2041-04-25",255,0,null,null,null,null,{"$f":"J272","v":255},{"$f":"K272","v":"2041-04-25"},0,0,0,0,10000,{"$f":"T272","v":"2041-04-25"},{"$f":"U272","v":256},0,"2041-04-25",255,0,null,null,null,"","","","","",51616,null,false,null,{"$f":"AD272","v":255},{"$f":"AE272","v":"2041-04-25"},0,0,0,0]
[null,256,0,null,0,0,0,null,null,256,"2041-05-25",null,null,null,0,0,0,0,null,"2041-05-25",257,0,"2041-05-25",256,0,null,null,null,null,256,"2041-05-25",0,0,0,0,10000,"2041-05-25",257,0,"2041-05-25",256,0,null,null,null,"","","","","",51646,null,false,null,256,"2041-05-25",0,0,0,0]
[null,257,0,null,0,0,0,null,null,257,"2041-06-25",null,null,null,0,0,0,0,null,{"$f":"EDATE(T273,1)","v":"2041-06-25"},258,{"$f":"IF(U274>$V$11,0,IF($H$7=1,-O275,-O274))","v":0},"2041-06-25",257,{"$f":"IF(X274>$Y$11,0,IF($H$7=1,-O274,V274))","v":0},null,null,null,null,257,"2041-06-25",0,0,0,0,10000,"2041-06-25",258,{"$f":"IF(AL274>$V$11,0,IF($H$7=1,-AF275,-AF274))","v":0},"2041-06-25",257,{"$f":"IF(AO274>$Y$11,0,IF($H$7=1,-AF274,AM274))","v":0},null,null,null,{"$f":"IF($B274=$C$7,B274,\"\")","v":""},{"$f":"IF($B274=$C$7,C274,\"\")","v":""},{"$f":"IF($B274=$C$7,E274,\"\")","v":""},{"$f":"IF($B274=$C$7,F274,\"\")","v":""},{"$f":"IF($B274=$C$7,G274,\"\")","v":""},{"$f":"K274","v":51677},null,false,null,257,"2041-06-25",0,0,0,0]
[null,258,{"$f":"IF(AND($A$7=0,$B275>$C$7),0,IF(AND($A$7=0,$B275=$C$7),ROUND(($F275+$E275),2),IF(AND($A$7=0,$D275=0),ROUND($C274,2),IF(AND($A$7=0,$B275=$B$13),ROUND($F275+$E275,2),IF($B275>$B$13,0,IF(AND($A$7=0,$D275<>0),ROUND($D275,2),IF($B275>$B$13,0,IF($B275=$B$13,ROUND($F275+$E275,2),ROUND(-PMT($E$13/12,$B$13,$C$13,0,0),2)))))))))","v":0},null,{"$f":"IF(B275>$B$13,0,ROUND(G274*$E$13/12,2))","v":0},0,0,null,null,258,"2041-07-25",null,null,null,0,0,{"$f":"IF($P$7=\"Oui\",O275-P275,F275)","v":0},{"$f":"IF(J275>$B$13,0,R274-Q275)","v":0},null,"2041-07-25",259,0,{"$f":"EDATE(W274,1)","v":"2041-07-25"},258,0,null,null,null,null,258,"2041-07-25",0,0,0,{"$f":"AI274-AH275","v":0},10000,"2041-07-25",259,0,{"$f":"EDATE(AN274,1)","v":"2041-07-25"},258,0,null,null,null,"","","","","",51707,null,false,null,258,"2041-07-25",0,0,0,{"$f":"BH274-BG275","v":0}]
[null,259,0,null,0,0,0,null,null,259,{"$f":"EDATE(K275,1)","v":"2041-08-25"},null,null,null,{"$f":"IF(J276>$C$7,0,IF($P$7=\"Oui\",IF(J276=$C$7,ROUND(Q276+P276,2),$AE$14),ROUND(C276,2)))","v":0},{"$f":"IF($P$7=\"Oui\",R275*$E$7/12,ROUND(R275*$E$7/12,2))","v":0},0,0,null,"2041-08-25",260,0,"2041-08-25",259,0,null,null,null,null,259,"2041-08-25",{"$f":"IF(AD276>$C$7,0,IF($P$7=\"Oui\",IF(AD276=$C$7,AH276+AG276,$AE$14),O276))","v":0},{"$f":"IF($P$7=\"Oui\",AI275*$AF$13/12,AI275*$E$7/12)","v":0},{"$f":"IF($P$7=\"Oui\",IF(AD276=$C$7,AI275,AF276-AG276),Q276)","v":0},0,10000,"2041-08-25",260,0,"2041-08-25",259,0,null,null,null,"","","","","",51738,null,false,null,259,"2041-08-25",0,{"$f":"BH275*$BE$13/12","v":0},0,0]
[null,260,0,null,0,0,0,null,null,260,"2041-09-25",null,null,null,0,0,0,0,null,"2041-09-25",261,0,"2041-09-25",260,0,null,null,null,null,260,"2041-09-25",0,0,0,0,10000,"2041-09-25",261,0,"2041-09-25",260,0,null,null,null,"","","","","",51769,null,false,null,260,"2041-09-25",0,0,0,0]
[null,261,0,null,0,0,0,null,null,261,"2041-10-25",null,null,null,0,0,0,0,null,"2041-10-25",262,0,"2041-10-25",261,0,null,null,null,null,261,"2041-10-25",0,0,0,0,10000,"2041-10-25",262,0,"2041-10-25",261,0,null,null,null,"","","","","",51799,null,false,null,261,"2041-10-25",0,0,0,0]
[null,262,0,null,0,0,0,null,null,262,"2041-11-25",null,null,null,0,0,0,0,null,"2041-11-25",263,0,"2041-11-25",262,0,null,null,null,null,262,"2041-11-25",0,0,0,0,10000,"2041-11-25",263,0,"2041-11-25",262,0,null,null,null,"","","","","",51830,null,false,null,262,"2041-11-25",0,0,0,0]
[null,263,0,null,0,0,0,null,null,263,"2041-12-25",null,null,null,0,0,0,0,null,"2041-12-25",264,0,"2041-12-25",263,0,null,null,null,null,263,"2041-12-25",0,0,0,0,10000,"2041-12-25",264,0,"2041-12-25",263,0,null,null,null,"","","","","",51860,null,false,null,263,"2041-12-25",{"$f":"AF280","v":0},0,{"$f":"IF(BC280=$C$7,BH279,BE280-BF280)","v":0},0]
[null,264,0,null,0,0,0,null,null,264,"2042-01-25",null,null,null,0,0,0,0,null,"2042-01-25",265,0,"2042-01-25",264,0,null,null,null,null,264,"2042-01-25",0,0,0,0,10000,"2042-01-25",265,0,"2042-01-25",264,0,null,null,null,"","","","","",51891,null,false,null,264,"2042-01-25",0,0,0,0]
[null,265,0,null,0,0,0,null,null,265,"2042-02-25",null,null,null,0,0,0,0,null,"2042-02-25",266,0,"2042-02-25",265,0,null,null,null,null,265,"2042-02-25",0,0,0,0,10000,"2042-02-25",266,0,"2042-02-25",265,0,null,null,null,"","","","","",51922,null,false,null,265,"2042-02-25",0,0,0,0]
[null,266,0,null,0,0,0,null,null,266,"2042-03-25",null,null,null,0,0,0,0,null,"2042-03-25",267,0,"2042-03-25",266,0,null,null,null,null,266,"2042-03-25",0,0,0,0,10000,"2042-03-25",267,0,"2042-03-25",266,0,null,null,null,"","","","","",51950,null,false,null,266,"2042-03-25",0,0,0,0]
[null,267,0,null,0,0,0,null,null,267,"2042-04-25",null,null,null,0,0,0,0,null,"2042-04-25",268,0,"2042-04-25",267,0,null,null,null,null,267,"2042-04-25",0,0,0,0,10000,"2042-04-25",268,0,"2042-04-25",267,0,null,null,null,"","","","","",51981,null,false,null,267,"2042-04-25",0,0,0,0]
[null,268,0,null,0,0,0,null,null,268,"2042-05-25",null,null,null,0,0,0,0,null,"2042-05-25",269,0,"2042-05-25",268,0,null,null,null,null,268,"2042-05-25",0,0,0,0,10000,"2042-05-25",269,0,"2042-05-25",268,0,null,null,null,"","","","","",52011,null,false,null,268,"2042-05-25",0,0,0,0]
[null,269,0,null,0,0,0,null,null,269,"2042-06-25",null,null,null,0,0,0,0,null,"2042-06-25",270,0,"2042-06-25",269,0,null,null,null,null,269,"2042-06-25",0,0,0,0,10000,"2042-06-25",270,0,"2042-06-25",269,0,null,null,null,"","","","","",52042,null,false,null,269,"2042-06-25",0,0,0,0]
[null,270,0,null,0,0,0,null,null,270,"2042-07-25",null,null,null,0,0,0,0,null,"2042-07-25",271,0,"2042-07-25",270,0,null,null,null,null,270,"2042-07-25",0,0,0,0,10000,"2042-07-25",271,0,"2042-07-25",270,0,null,null,null,"","","","","",52072,null,false,null,270,"2042-07-25",0,0,0,0]
[null,271,0,null,0,0,0,null,null,271,"2042-08-25",null,null,null,0,0,0,0,null,"2042-08-25",272,0,"2042-08-25",271,0,null,null,null,null,271,"2042-08-25",0,0,0,0,10000,"2042-08-25",272,0,"2042-08-25",271,0,null,null,null,"","","","","",52103,null,false,null,271,"2042-08-25",0,0,0,0]
[null,272,0,null,0,0,0,null,null,272,"2042-09-25",null,null,null,0,0,0,0,null,"2042-09-25",273,0,"2042-09-25",272,0,null,null,null,null,272,"2042-09-25",0,0,0,0,10000,"2042-09-25",273,0,"2042-09-25",272,0,null,null,null,"","","","","",52134,null,false,null,272,"2042-09-25",0,0,0,0]
[null,273,0,null,0,0,0,null,null,273,"2042-10-25",null,null,null,0,0,0,0,null,"2042-10-25",274,0,"2042-10-25",273,0,null,null,null,null,273,"2042-10-25",0,0,0,0,10000,"2042-10-25",274,0,"2042-10-25",273,0,null,null,null,"","","","","",52164,null,false,null,273,"2042-10-25",0,0,0,0]
[null,274,0,null,0,0,0,null,null,274,"2042-11-25",null,null,null,0,0,0,0,null,"2042-11-25",275,0,"2042-11-25",274,0,null,null,null,null,274,"2042-11-25",0,0,0,0,10000,"2042-11-25",275,0,"2042-11-25",274,0,null,null,null,"","","","","",52195,null,false,null,274,"2042-11-25",0,0,0,0]
[null,275,0,null,0,0,0,null,null,275,"2042-12-25",null,null,null,0,0,0,0,null,"2042-12-25",276,0,"2042-12-25",275,0,null,null,null,null,275,"2042-12-25",0,0,0,0,10000,"2042-12-25",276,0,"2042-12-25",275,0,null,null,null,"","","","","",52225,null,false,null,275,"2042-12-25",0,0,0,0]
[null,276,0,null,0,0,0,null,null,276,"2043-01-25",null,null,null,0,0,0,0,null,"2043-01-25",277,0,"2043-01-25",276,0,null,null,null,null,276,"2043-01-25",0,0,0,0,10000,"2043-01-25",277,0,"2043-01-25",276,0,null,null,null,"","","","","",52256,null,false,null,276,"2043-01-25",0,0,0,0]
[null,277,0,null,0,0,0,null,null,277,"2043-02-25",null,null,null,0,0,0,0,null,"2043-02-25",278,0,"2043-02-25",277,0,null,null,null,null,277,"2043-02-25",0,0,0,0,10000,"2043-02-25",278,0,"2043-02-25",277,0,null,null,null,"","","","","",52287,null,false,null,277,"2043-02-25",0,0,0,0]
[null,278,0,null,0,0,0,null,null,278,"2043-03-25",null,null,null,0,0,0,0,null,"2043-03-25",279,0,"2043-03-25",278,0,null,null,null,null,278,"2043-03-25",0,0,0,0,10000,"2043-03-25",279,0,"2043-03-25",278,0,null,null,null,"","","","","",52315,null,false,null,278,"2043-03-25",0,0,0,0]
[null,279,0,null,0,0,0,null,null,279,"2043-04-25",null,null,null,0,0,0,0,null,"2043-04-25",280,0,"2043-04-25",279,0,null,null,null,null,279,"2043-04-25",0,0,0,0,10000,"2043-04-25",280,0,"2043-04-25",279,0,null,null,null,"","","","","",52346,null,false,null,279,"2043-04-25",0,0,0,0]
[null,280,0,null,0,0,0,null,null,280,"2043-05-25",null,null,null,0,0,0,0,null,"2043-05-25",281,0,"2043-05-25",280,0,null,null,null,null,280,"2043-05-25",0,0,0,0,10000,"2043-05-25",281,0,"2043-05-25",280,0,null,null,null,"","","","","",52376,null,false,null,280,"2043-05-25",0,0,0,0]
[null,281,0,null,0,0,0,null,null,281,"2043-06-25",null,null,null,0,0,0,0,null,"2043-06-25",282,0,"2043-06-25",281,0,null,null,null,null,281,"2043-06-25",0,0,0,0,10000,"2043-06-25",282,0,"2043-06-25",281,0,null,null,null,"","","","","",52407,null,false,null,281,"2043-06-25",0,0,0,0]
[null,282,0,null,0,0,0,null,null,282,"2043-07-25",null,null,null,0,0,0,0,null,"2043-07-25",283,0,"2043-07-25",282,0,null,null,null,null,282,"2043-07-25",0,0,0,0,10000,"2043-07-25",283,0,"2043-07-25",282,0,null,null,null,"","","","","",52437,null,false,null,282,"2043-07-25",0,0,0,0]
[null,283,0,null,0,0,0,null,null,283,"2043-08-25",null,null,null,0,0,0,0,null,"2043-08-25",284,0,"2043-08-25",283,0,null,null,null,null,283,"2043-08-25",0,0,0,0,10000,"2043-08-25",284,0,"2043-08-25",283,0,null,null,null,"","","","","",52468,null,false,null,283,"2043-08-25",0,0,0,0]
[null,284,0,null,0,0,0,null,null,284,"2043-09-25",null,null,null,0,0,0,0,null,"2043-09-25",285,0,"2043-09-25",284,0,null,null,null,null,284,"2043-09-25",0,0,0,0,10000,"2043-09-25",285,0,"2043-09-25",284,0,null,null,null,"","","","","",52499,null,false,null,284,"2043-09-25",0,0,0,0]
[null,285,0,null,0,0,0,null,null,285,"2043-10-25",null,null,null,0,0,0,0,null,"2043-10-25",286,0,"2043-10-25",285,0,null,null,null,null,285,"2043-10-25",0,0,0,0,10000,"2043-10-25",286,0,"2043-10-25",285,0,null,null,null,"","","","","",52529,null,false,null,285,"2043-10-25",0,0,0,0]
[null,286,0,null,0,0,0,null,null,286,"2043-11-25",null,null,null,0,0,0,0,null,"2043-11-25",287,0,"2043-11-25",286,0,null,null,null,null,286,"2043-11-25",0,0,0,0,10000,"2043-11-25",287,0,"2043-11-25",286,0,null,null,null,"","","","","",52560,null,false,null,286,"2043-11-25",0,0,0,0]
[null,287,0,null,0,0,0,null,null,287,"2043-12-25",null,null,null,0,0,0,0,null,"2043-12-25",288,0,"2043-12-25",287,0,null,null,null,null,287,"2043-12-25",0,0,0,0,10000,"2043-12-25",288,0,"2043-12-25",287,0,null,null,null,"","","","","",52590,null,false,null,287,"2043-12-25",0,0,0,0]
[null,288,0,null,0,0,0,null,null,288,"2044-01-25",null,null,null,0,0,0,0,null,"2044-01-25",289,0,"2044-01-25",288,0,null,null,null,null,288,"2044-01-25",0,0,0,0,10000,"2044-01-25",289,0,"2044-01-25",288,0,null,null,null,"","","","","",52621,null,false,null,288,"2044-01-25",0,0,0,0]
[null,289,0,null,0,0,0,null,null,289,"2044-02-25",null,null,null,0,0,0,0,null,"2044-02-25",290,0,"2044-02-25",289,0,null,null,null,null,289,"2044-02-25",0,0,0,0,10000,"2044-02-25",290,0,"2044-02-25",289,0,null,null,null,"","","","","",52652,null,false,null,289,"2044-02-25",0,0,0,0]
[null,290,0,null,0,0,0,null,null,290,"2044-03-25",null,null,null,0,0,0,0,null,"2044-03-25",291,0,"2044-03-25",290,0,null,null,null,null,290,"2044-03-25",0,0,0,0,10000,"2044-03-25",291,0,"2044-03-25",290,0,null,null,null,"","","","","",52681,null,false,null,290,"2044-03-25",0,0,0,0]
[null,291,0,null,0,0,0,null,null,291,"2044-04-25",null,null,null,0,0,0,0,null,"2044-04-25",292,0,"2044-04-25",291,0,null,null,null,null,291,"2044-04-25",0,0,0,0,10000,"2044-04-25",292,0,"2044-04-25",291,0,null,null,null,"","","","","",52712,null,false,null,291,"2044-04-25",0,0,0,0]
[null,292,0,null,0,0,0,null,null,292,"2044-05-25",null,null,null,0,0,0,0,null,"2044-05-25",293,0,"2044-05-25",292,0,null,null,null,null,292,"2044-05-25",0,0,0,0,10000,"2044-05-25",293,0,"2044-05-25",292,0,null,null,null,"","","","","",52742,null,false,null,292,"2044-05-25",0,0,0,0]
[null,293,0,null,0,0,0,null,null,293,"2044-06-25",null,null,null,0,0,0,0,null,"2044-06-25",294,0,"2044-06-25",293,0,null,null,null,null,293,"2044-06-25",0,0,0,0,10000,"2044-06-25",294,0,"2044-06-25",293,0,null,null,null,"","","","","",52773,null,false,null,293,"2044-06-25",0,0,0,0]
[null,294,0,null,0,0,0,null,null,294,"2044-07-25",null,null,null,0,0,0,0,null,"2044-07-25",295,0,"2044-07-25",294,0,null,null,null,null,294,"2044-07-25",0,0,0,0,10000,"2044-07-25",295,0,"2044-07-25",294,0,null,null,null,"","","","","",52803,null,false,null,294,"2044-07-25",0,0,0,0]
[null,295,0,null,0,0,0,null,null,295,"2044-08-25",null,null,null,0,0,0,0,null,"2044-08-25",296,0,"2044-08-25",295,0,null,null,null,null,295,"2044-08-25",0,0,0,0,10000,"2044-08-25",296,0,"2044-08-25",295,0,null,null,null,"","","","","",52834,null,false,null,295,"2044-08-25",0,0,0,0]
[null,296,0,null,0,0,0,null,null,296,"2044-09-25",null,null,null,0,0,0,0,null,"2044-09-25",297,0,"2044-09-25",296,0,null,null,null,null,296,"2044-09-25",0,0,0,0,10000,"2044-09-25",297,0,"2044-09-25",296,0,null,null,null,"","","","","",52865,null,false,null,296,"2044-09-25",0,0,0,0]
[null,297,0,null,0,0,0,null,null,297,"2044-10-25",null,null,null,0,0,0,0,null,"2044-10-25",298,0,"2044-10-25",297,0,null,null,null,null,297,"2044-10-25",0,0,0,0,10000,"2044-10-25",298,0,"2044-10-25",297,0,null,null,null,"","","","","",52895,null,{"$f":"IF($B314=$C$7,IF(AND($A$7=0,$B314>$C$7),0,IF(AND($A$7=0,$D314=0),$C313,IF(AND($A$7=0,$B314=$B$13),ROUNDDOWN($F314+$E314,2),IF($B314>$B$13,0,IF(AND($A$7=0,$D314<>0),$D314,IF($B314>$B$13,0,IF($B314=$B$13,ROUNDDOWN($F314+$E314,2),ROUND(-PMT($E$13/12,$B$13,$C$13,0,0),2)))))))))","v":false},null,297,"2044-10-25",0,0,0,0]
[null,298,0,null,0,0,0,null,null,298,"2044-11-25",null,null,null,0,0,0,0,null,"2044-11-25",299,0,"2044-11-25",298,0,null,null,null,null,298,"2044-11-25",0,0,0,0,10000,"2044-11-25",299,0,"2044-11-25",298,0,null,null,null,"","","","","",52926,null,false,null,298,"2044-11-25",0,0,0,0]
[null,299,0,null,0,0,0,null,null,299,"2044-12-25",null,null,null,0,0,0,0,null,"2044-12-25",300,0,"2044-12-25",299,0,null,null,null,null,299,"2044-12-25",0,0,0,0,10000,"2044-12-25",300,0,"2044-12-25",299,0,null,null,null,"","","","","",52956,null,false,null,299,"2044-12-25",0,0,0,0]
[null,300,0,null,0,0,0,null,null,300,"2045-01-25",null,null,null,0,0,0,0,null,"2045-01-25",301,0,"2045-01-25",300,0,null,null,null,null,300,"2045-01-25",0,0,0,0,10000,"2045-01-25",301,0,"2045-01-25",300,0,null,null,null,"","","","","",52987,null,false,null,300,"2045-01-25",0,0,0,0]
[null,301,0,null,0,{"$f":"IF(B318>$B$13,0,IF(B318=$B$13,G317,C318-E318))","v":0},0,null,null,301,"2045-02-25",null,null,null,0,0,0,0,null,"2045-02-25",302,{"$f":"IF(U318>$V$11,0,IF($H$7=1,-O319,-O318))","v":0},"2045-02-25",301,0,null,null,null,null,301,"2045-02-25",0,0,0,0,10000,"2045-02-25",302,0,"2045-02-25",301,0,null,null,null,"","","","","",53018,null,false,null,301,"2045-02-25",0,0,0,0]
[null,302,0,null,0,0,0,null,null,302,"2045-03-25",null,null,null,0,0,0,0,null,"2045-03-25",303,0,"2045-03-25",302,0,null,null,null,null,302,"2045-03-25",0,0,0,0,10000,"2045-03-25",303,0,"2045-03-25",302,0,null,null,null,"","","","","",53046,null,false,null,302,"2045-03-25",0,0,0,0]
[null,303,0,null,0,0,0,null,null,303,"2045-04-25",null,null,null,0,0,0,0,null,"2045-04-25",304,0,"2045-04-25",303,0,null,null,null,null,303,"2045-04-25",0,0,0,0,10000,"2045-04-25",304,0,"2045-04-25",303,0,null,null,null,"","","","","",53077,null,false,null,303,"2045-04-25",0,0,0,0]
[null,304,0,null,0,0,0,null,null,304,"2045-05-25",null,null,null,0,0,0,0,null,"2045-05-25",305,0,"2045-05-25",304,0,null,null,null,null,304,"2045-05-25",0,0,0,0,10000,"2045-05-25",305,0,"2045-05-25",304,0,null,null,null,"","","","","",53107,null,false,null,304,"2045-05-25",0,0,0,0]
[null,305,0,null,0,0,0,null,null,305,"2045-06-25",null,null,null,0,0,0,0,null,"2045-06-25",306,0,"2045-06-25",305,0,null,null,null,null,305,"2045-06-25",0,0,0,0,{"$f":"IF(AD322<>$C$7,10000,AI692)","v":10000},"2045-06-25",306,0,"2045-06-25",305,0,null,null,null,"","","","","",53138,null,false,null,305,"2045-06-25",0,0,0,0]
[null,306,0,null,0,0,0,null,null,306,"2045-07-25",null,null,null,0,0,0,0,null,"2045-07-25",307,0,"2045-07-25",306,0,null,null,null,null,306,"2045-07-25",0,0,0,0,10000,"2045-07-25",307,0,"2045-07-25",306,0,null,null,null,"","","","","",53168,null,false,null,306,"2045-07-25",0,0,0,0]
[null,307,0,null,0,0,0,null,null,307,"2045-08-25",null,null,null,0,0,0,0,null,"2045-08-25",308,0,"2045-08-25",307,0,null,null,null,null,307,"2045-08-25",0,0,0,0,10000,"2045-08-25",308,0,"2045-08-25",307,0,null,null,null,"","","","","",53199,null,false,null,307,"2045-08-25",0,0,0,0]
[null,308,0,null,0,0,0,null,null,308,"2045-09-25",null,null,null,0,0,0,0,null,"2045-09-25",309,0,"2045-09-25",308,0,null,null,null,null,308,"2045-09-25",0,0,0,0,10000,"2045-09-25",309,0,"2045-09-25",308,0,null,null,null,"","","","","",53230,null,false,null,308,"2045-09-25",0,0,0,0]
[null,309,0,null,0,0,0,null,null,309,"2045-10-25",null,null,null,0,0,0,0,null,"2045-10-25",310,0,"2045-10-25",309,0,null,null,null,null,309,"2045-10-25",0,0,0,0,10000,"2045-10-25",310,0,"2045-10-25",309,0,null,null,null,"","","","","",53260,null,false,null,309,"2045-10-25",0,0,0,0]
[null,310,0,null,0,{"$f":"IF(B327>$B$13,0,IF(B327=$B$13,G326,C327-E327))","v":0},{"$f":"IF(B327>$B$13,0,G326-F327)","v":0},null,null,310,"2045-11-25",null,null,null,0,0,0,0,null,"2045-11-25",311,0,"2045-11-25",310,0,null,null,null,null,310,"2045-11-25",0,0,0,0,10000,"2045-11-25",311,0,"2045-11-25",310,0,null,null,null,"","","","","",53291,null,false,null,310,"2045-11-25",0,0,0,0]
[null,311,0,null,0,0,0,null,null,311,"2045-12-25",null,null,null,0,0,0,0,null,"2045-12-25",312,0,"2045-12-25",311,0,null,null,null,null,311,"2045-12-25",0,0,0,0,10000,"2045-12-25",312,0,"2045-12-25",311,0,null,null,null,"","","","","",53321,null,false,null,311,"2045-12-25",0,0,0,0]
[null,312,0,null,0,0,0,null,null,312,"2046-01-25",null,null,null,0,0,0,0,null,"2046-01-25",313,0,"2046-01-25",312,0,null,null,null,null,312,"2046-01-25",0,0,0,0,10000,"2046-01-25",313,0,"2046-01-25",312,0,null,null,null,"","","","","",53352,null,false,null,312,"2046-01-25",0,0,0,0]
[null,313,0,null,0,0,0,null,null,313,"2046-02-25",null,null,null,0,0,0,0,null,"2046-02-25",314,0,"2046-02-25",313,0,null,null,null,null,313,"2046-02-25",0,0,0,0,10000,"2046-02-25",314,0,"2046-02-25",313,0,null,null,null,"","","","","",53383,null,false,null,313,"2046-02-25",0,0,0,0]
[null,314,0,null,0,0,0,null,null,314,"2046-03-25",null,null,null,0,0,0,0,null,"2046-03-25",315,0,"2046-03-25",314,0,null,null,null,null,314,"2046-03-25",0,0,0,0,10000,"2046-03-25",315,0,"2046-03-25",314,0,null,null,null,"","","","","",53411,null,false,null,314,"2046-03-25",0,0,0,0]
[null,315,0,null,0,0,0,null,null,315,"2046-04-25",null,null,null,0,0,0,0,null,"2046-04-25",316,0,"2046-04-25",315,0,null,null,null,null,315,"2046-04-25",0,0,0,0,10000,"2046-04-25",316,0,"2046-04-25",315,0,null,null,null,"","","","","",53442,null,false,null,315,"2046-04-25",0,0,0,0]
[null,316,0,null,0,0,0,null,null,316,"2046-05-25",null,null,null,0,0,0,0,null,"2046-05-25",317,0,"2046-05-25",316,0,null,null,null,null,316,"2046-05-25",0,0,0,0,10000,"2046-05-25",317,0,"2046-05-25",316,0,null,null,null,"","","","","",53472,null,false,null,316,"2046-05-25",0,0,0,0]
[null,317,0,null,0,0,0,null,null,317,"2046-06-25",null,null,null,0,0,0,0,null,"2046-06-25",318,0,"2046-06-25",317,0,null,null,null,null,317,"2046-06-25",0,0,0,0,10000,"2046-06-25",318,0,"2046-06-25",317,0,null,null,null,"","","","","",53503,null,false,null,317,"2046-06-25",0,0,0,0]
[null,318,0,null,0,0,0,null,null,318,"2046-07-25",null,null,null,0,0,0,0,null,"2046-07-25",319,0,"2046-07-25",318,0,null,null,null,null,318,"2046-07-25",0,0,0,0,10000,"2046-07-25",319,0,"2046-07-25",318,0,null,null,null,"","","","","",53533,null,false,null,318,"2046-07-25",0,0,0,0]
[null,319,0,null,0,0,0,null,null,319,"2046-08-25",null,null,null,0,0,0,0,null,"2046-08-25",320,0,"2046-08-25",319,0,null,null,null,null,{"$f":"J336","v":319},{"$f":"K336","v":"2046-08-25"},0,0,0,0,10000,{"$f":"T336","v":"2046-08-25"},{"$f":"U336","v":320},0,"2046-08-25",319,0,null,null,null,"","","","","",53564,null,false,null,{"$f":"AD336","v":319},{"$f":"AE336","v":"2046-08-25"},0,0,0,0]
[null,320,0,null,0,0,0,null,null,320,"2046-09-25",null,null,null,0,0,0,0,null,"2046-09-25",321,0,"2046-09-25",320,0,null,null,null,null,320,"2046-09-25",0,0,0,0,10000,"2046-09-25",321,0,"2046-09-25",320,0,null,null,null,"","","","","",53595,null,false,null,320,"2046-09-25",0,0,0,0]
[null,321,0,null,0,0,0,null,null,321,"2046-10-25",null,null,null,0,0,0,0,null,{"$f":"EDATE(T337,1)","v":"2046-10-25"},322,{"$f":"IF(U338>$V$11,0,IF($H$7=1,-O339,-O338))","v":0},"2046-10-25",321,{"$f":"IF(X338>$Y$11,0,IF($H$7=1,-O338,V338))","v":0},null,null,null,null,321,"2046-10-25",0,0,0,0,10000,"2046-10-25",322,{"$f":"IF(AL338>$V$11,0,IF($H$7=1,-AF339,-AF338))","v":0},"2046-10-25",321,{"$f":"IF(AO338>$Y$11,0,IF($H$7=1,-AF338,AM338))","v":0},null,null,null,{"$f":"IF($B338=$C$7,B338,\"\")","v":""},{"$f":"IF($B338=$C$7,C338,\"\")","v":""},{"$f":"IF($B338=$C$7,E338,\"\")","v":""},{"$f":"IF($B338=$C$7,F338,\"\")","v":""},{"$f":"IF($B338=$C$7,G338,\"\")","v":""},{"$f":"K338","v":53625},null,false,null,321,"2046-10-25",0,0,0,0]
[null,322,{"$f":"IF(AND($A$7=0,$B339>$C$7),0,IF(AND($A$7=0,$B339=$C$7),ROUND(($F339+$E339),2),IF(AND($A$7=0,$D339=0),ROUND($C338,2),IF(AND($A$7=0,$B339=$B$13),ROUND($F339+$E339,2),IF($B339>$B$13,0,IF(AND($A$7=0,$D339<>0),ROUND($D339,2),IF($B339>$B$13,0,IF($B339=$B$13,ROUND($F339+$E339,2),ROUND(-PMT($E$13/12,$B$13,$C$13,0,0),2)))))))))","v":0},null,{"$f":"IF(B339>$B$13,0,ROUND(G338*$E$13/12,2))","v":0},0,0,null,null,322,"2046-11-25",null,null,null,0,0,{"$f":"IF($P$7=\"Oui\",O339-P339,F339)","v":0},{"$f":"IF(J339>$B$13,0,R338-Q339)","v":0},null,"2046-11-25",323,0,{"$f":"EDATE(W338,1)","v":"2046-11-25"},322,0,null,null,null,null,322,"2046-11-25",0,0,0,{"$f":"AI338-AH339","v":0},10000,"2046-11-25",323,0,{"$f":"EDATE(AN338,1)","v":"2046-11-25"},322,0,null,null,null,"","","","","",53656,null,false,null,322,"2046-11-25",0,0,0,{"$f":"BH338-BG339","v":0}]
[null,323,0,null,0,0,0,null,null,323,{"$f":"EDATE(K339,1)","v":"2046-12-25"},null,null,null,{"$f":"IF(J340>$C$7,0,IF($P$7=\"Oui\",IF(J340=$C$7,ROUND(Q340+P340,2),$AE$14),ROUND(C340,2)))","v":0},{"$f":"IF($P$7=\"Oui\",R339*$E$7/12,ROUND(R339*$E$7/12,2))","v":0},0,0,null,"2046-12-25",324,0,"2046-12-25",323,0,null,null,null,null,323,"2046-12-25",{"$f":"IF(AD340>$C$7,0,IF($P$7=\"Oui\",IF(AD340=$C$7,AH340+AG340,$AE$14),O340))","v":0},{"$f":"IF($P$7=\"Oui\",AI339*$AF$13/12,AI339*$E$7/12)","v":0},{"$f":"IF($P$7=\"Oui\",IF(AD340=$C$7,AI339,AF340-AG340),Q340)","v":0},0,10000,"2046-12-25",324,0,"2046-12-25",323,0,null,null,null,"","","","","",53686,null,false,null,323,"2046-12-25",0,{"$f":"BH339*$BE$13/12","v":0},0,0]
[null,324,0,null,0,0,0,null,null,324,"2047-01-25",null,null,null,0,0,0,0,null,"2047-01-25",325,0,"2047-01-25",324,0,null,null,null,null,324,"2047-01-25",0,0,0,0,10000,"2047-01-25",325,0,"2047-01-25",324,0,null,null,null,"","","","","",53717,null,false,null,324,"2047-01-25",0,0,0,0]
[null,325,0,null,0,0,0,null,null,325,"2047-02-25",null,null,null,0,0,0,0,null,"2047-02-25",326,0,"2047-02-25",325,0,null,null,null,null,325,"2047-02-25",0,0,0,0,10000,"2047-02-25",326,0,"2047-02-25",325,0,null,null,null,"","","","","",53748,null,false,null,325,"2047-02-25",0,0,0,0]
[null,326,0,null,0,0,0,null,null,326,"2047-03-25",null,null,null,0,0,0,0,null,"2047-03-25",327,0,"2047-03-25",326,0,null,null,null,null,326,"2047-03-25",0,0,0,0,10000,"2047-03-25",327,0,"2047-03-25",326,0,null,null,null,"","","","","",53776,null,false,null,326,"2047-03-25",0,0,0,0]
[null,327,0,null,0,0,0,null,null,327,"2047-04-25",null,null,null,0,0,0,0,null,"2047-04-25",328,0,"2047-04-25",327,0,null,null,null,null,327,"2047-04-25",0,0,0,0,10000,"2047-04-25",328,0,"2047-04-25",327,0,null,null,null,"","","","","",53807,null,false,null,327,"2047-04-25",{"$f":"AF344","v":0},0,{"$f":"IF(BC344=$C$7,BH343,BE344-BF344)","v":0},0]
[null,328,0,null,0,0,0,null,null,328,"2047-05-25",null,null,null,0,0,0,0,null,"2047-05-25",329,0,"2047-05-25",328,0,null,null,null,null,328,"2047-05-25",0,0,0,0,10000,"2047-05-25",329,0,"2047-05-25",328,0,null,null,null,"","","","","",53837,null,false,null,328,"2047-05-25",0,0,0,0]
[null,329,0,null,0,0,0,null,null,329,"2047-06-25",null,null,null,0,0,0,0,null,"2047-06-25",330,0,"2047-06-25",329,0,null,null,null,null,329,"2047-06-25",0,0,0,0,10000,"2047-06-25",330,0,"2047-06-25",329,0,null,null,null,"","","","","",53868,null,false,null,329,"2047-06-25",0,0,0,0]
[null,330,0,null,0,0,0,null,null,330,"2047-07-25",null,null,null,0,0,0,0,null,"2047-07-25",331,0,"2047-07-25",330,0,null,null,null,null,330,"2047-07-25",0,0,0,0,10000,"2047-07-25",331,0,"2047-07-25",330,0,null,null,null,"","","","","",53898,null,false,null,330,"2047-07-25",0,0,0,0]
[null,331,0,null,0,0,0,null,null,331,"2047-08-25",null,null,null,0,0,0,0,null,"2047-08-25",332,0,"2047-08-25",331,0,null,null,null,null,331,"2047-08-25",0,0,0,0,10000,"2047-08-25",332,0,"2047-08-25",331,0,null,null,null,"","","","","",53929,null,false,null,331,"2047-08-25",0,0,0,0]
[null,332,0,null,0,0,0,null,null,332,"2047-09-25",null,null,null,0,0,0,0,null,"2047-09-25",333,0,"2047-09-25",332,0,null,null,null,null,332,"2047-09-25",0,0,0,0,10000,"2047-09-25",333,0,"2047-09-25",332,0,null,null,null,"","","","","",53960,null,false,null,332,"2047-09-25",0,0,0,0]
[null,333,0,null,0,0,0,null,null,333,"2047-10-25",null,null,null,0,0,0,0,null,"2047-10-25",334,0,"2047-10-25",333,0,null,null,null,null,333,"2047-10-25",0,0,0,0,10000,"2047-10-25",334,0,"2047-10-25",333,0,null,null,null,"","","","","",53990,null,false,null,333,"2047-10-25",0,0,0,0]
[null,334,0,null,0,0,0,null,null,334,"2047-11-25",null,null,null,0,0,0,0,null,"2047-11-25",335,0,"2047-11-25",334,0,null,null,null,null,334,"2047-11-25",0,0,0,0,10000,"2047-11-25",335,0,"2047-11-25",334,0,null,null,null,"","","","","",54021,null,false,null,334,"2047-11-25",0,0,0,0]
[null,335,0,null,0,0,0,null,null,335,"2047-12-25",null,null,null,0,0,0,0,null,"2047-12-25",336,0,"2047-12-25",335,0,null,null,null,null,335,"2047-12-25",0,0,0,0,10000,"2047-12-25",336,0,"2047-12-25",335,0,null,null,null,"","","","","",54051,null,false,null,335,"2047-12-25",0,0,0,0]
[null,336,0,null,0,0,0,null,null,336,"2048-01-25",null,null,null,0,0,0,0,null,"2048-01-25",337,0,"2048-01-25",336,0,null,null,null,null,336,"2048-01-25",0,0,0,0,10000,"2048-01-25",337,0,"2048-01-25",336,0,null,null,null,"","","","","",54082,null,false,null,336,"2048-01-25",0,0,0,0]
[null,337,0,null,0,0,0,null,null,337,"2048-02-25",null,null,null,0,0,0,0,null,"2048-02-25",338,0,"2048-02-25",337,0,null,null,null,null,337,"2048-02-25",0,0,0,0,10000,"2048-02-25",338,0,"2048-02-25",337,0,null,null,null,"","","","","",54113,null,false,null,337,"2048-02-25",0,0,0,0]
[null,338,0,null,0,0,0,null,null,338,"2048-03-25",null,null,null,0,0,0,0,null,"2048-03-25",339,0,"2048-03-25",338,0,null,null,null,null,338,"2048-03-25",0,0,0,0,10000,"2048-03-25",339,0,"2048-03-25",338,0,null,null,null,"","","","","",54142,null,false,null,338,"2048-03-25",0,0,0,0]
[null,339,0,null,0,0,0,null,null,339,"2048-04-25",null,null,null,0,0,0,0,null,"2048-04-25",340,0,"2048-04-25",339,0,null,null,null,null,339,"2048-04-25",0,0,0,0,10000,"2048-04-25",340,0,"2048-04-25",339,0,null,null,null,"","","","","",54173,null,false,null,339,"2048-04-25",0,0,0,0]
[null,340,0,null,0,0,0,null,null,340,"2048-05-25",null,null,null,0,0,0,0,null,"2048-05-25",341,0,"2048-05-25",340,0,null,null,null,null,340,"2048-05-25",0,0,0,0,10000,"2048-05-25",341,0,"2048-05-25",340,0,null,null,null,"","","","","",54203,null,false,null,340,"2048-05-25",0,0,0,0]
[null,341,0,null,0,0,0,null,null,341,"2048-06-25",null,null,null,0,0,0,0,null,"2048-06-25",342,0,"2048-06-25",341,0,null,null,null,null,341,"2048-06-25",0,0,0,0,10000,"2048-06-25",342,0,"2048-06-25",341,0,null,null,null,"","","","","",54234,null,false,null,341,"2048-06-25",0,0,0,0]
[null,342,0,null,0,0,0,null,null,342,"2048-07-25",null,null,null,0,0,0,0,null,"2048-07-25",343,0,"2048-07-25",342,0,null,null,null,null,342,"2048-07-25",0,0,0,0,10000,"2048-07-25",343,0,"2048-07-25",342,0,null,null,null,"","","","","",54264,null,false,null,342,"2048-07-25",0,0,0,0]
[null,343,0,null,0,0,0,null,null,343,"2048-08-25",null,null,null,0,0,0,0,null,"2048-08-25",344,0,"2048-08-25",343,0,null,null,null,null,343,"2048-08-25",0,0,0,0,10000,"2048-08-25",344,0,"2048-08-25",343,0,null,null,null,"","","","","",54295,null,false,null,343,"2048-08-25",0,0,0,0]
[null,344,0,null,0,0,0,null,null,344,"2048-09-25",null,null,null,0,0,0,0,null,"2048-09-25",345,0,"2048-09-25",344,0,null,null,null,null,344,"2048-09-25",0,0,0,0,10000,"2048-09-25",345,0,"2048-09-25",344,0,null,null,null,"","","","","",54326,null,false,null,344,"2048-09-25",0,0,0,0]
[null,345,0,null,0,0,0,null,null,345,"2048-10-25",null,null,null,0,0,0,0,null,"2048-10-25",346,0,"2048-10-25",345,0,null,null,null,null,345,"2048-10-25",0,0,0,0,10000,"2048-10-25",346,0,"2048-10-25",345,0,null,null,null,"","","","","",54356,null,false,null,345,"2048-10-25",0,0,0,0]
[null,346,0,null,0,0,0,null,null,346,"2048-11-25",null,null,null,0,0,0,0,null,"2048-11-25",347,0,"2048-11-25",346,0,null,null,null,null,346,"2048-11-25",0,0,0,0,10000,"2048-11-25",347,0,"2048-11-25",346,0,null,null,null,"","","","","",54387,null,false,null,346,"2048-11-25",0,0,0,0]
[null,347,0,null,0,0,0,null,null,347,"2048-12-25",null,null,null,0,0,0,0,null,"2048-12-25",348,0,"2048-12-25",347,0,null,null,null,null,347,"2048-12-25",0,0,0,0,10000,"2048-12-25",348,0,"2048-12-25",347,0,null,null,null,"","","","","",54417,null,false,null,347,"2048-12-25",0,0,0,0]
[null,348,0,null,0,0,0,null,null,348,"2049-01-25",null,null,null,0,0,0,0,null,"2049-01-25",349,0,"2049-01-25",348,0,null,null,null,null,348,"2049-01-25",0,0,0,0,10000,"2049-01-25",349,0,"2049-01-25",348,0,null,null,null,"","","","","",54448,null,false,null,348,"2049-01-25",0,0,0,0]
[null,349,0,null,0,0,0,null,null,349,"2049-02-25",null,null,null,0,0,0,0,null,"2049-02-25",350,0,"2049-02-25",349,0,null,null,null,null,349,"2049-02-25",0,0,0,0,10000,"2049-02-25",350,0,"2049-02-25",349,0,null,null,null,"","","","","",54479,null,false,null,349,"2049-02-25",0,0,0,0]
[null,350,0,null,0,0,0,null,null,350,"2049-03-25",null,null,null,0,0,0,0,null,"2049-03-25",351,0,"2049-03-25",350,0,null,null,null,null,350,"2049-03-25",0,0,0,0,10000,"2049-03-25",351,0,"2049-03-25",350,0,null,null,null,"","","","","",54507,null,false,null,350,"2049-03-25",0,0,0,0]
[null,351,0,null,0,0,0,null,null,351,"2049-04-25",null,null,null,0,0,0,0,null,"2049-04-25",352,0,"2049-04-25",351,0,null,null,null,null,351,"2049-04-25",0,0,0,0,10000,"2049-04-25",352,0,"2049-04-25",351,0,null,null,null,"","","","","",54538,null,false,null,351,"2049-04-25",0,0,0,0]
[null,352,0,null,0,0,0,null,null,352,"2049-05-25",null,null,null,0,0,0,0,null,"2049-05-25",353,0,"2049-05-25",352,0,null,null,null,null,352,"2049-05-25",0,0,0,0,10000,"2049-05-25",353,0,"2049-05-25",352,0,null,null,null,"","","","","",54568,null,false,null,352,"2049-05-25",0,0,0,0]
[null,353,0,null,0,0,0,null,null,353,"2049-06-25",null,null,null,0,0,0,0,null,"2049-06-25",354,0,"2049-06-25",353,0,null,null,null,null,353,"2049-06-25",0,0,0,0,10000,"2049-06-25",354,0,"2049-06-25",353,0,null,null,null,"","","","","",54599,null,false,null,353,"2049-06-25",0,0,0,0]
[null,354,0,null,0,0,0,null,null,354,"2049-07-25",null,null,null,0,0,0,0,null,"2049-07-25",355,0,"2049-07-25",354,0,null,null,null,null,354,"2049-07-25",0,0,0,0,10000,"2049-07-25",355,0,"2049-07-25",354,0,null,null,null,"","","","","",54629,null,false,null,354,"2049-07-25",0,0,0,0]
[null,355,0,null,0,0,0,null,null,355,"2049-08-25",null,null,null,0,0,0,0,null,"2049-08-25",356,0,"2049-08-25",355,0,null,null,null,null,355,"2049-08-25",0,0,0,0,10000,"2049-08-25",356,0,"2049-08-25",355,0,null,null,null,"","","","","",54660,null,false,null,355,"2049-08-25",0,0,0,0]
[null,356,0,null,0,0,0,null,null,356,"2049-09-25",null,null,null,0,0,0,0,null,"2049-09-25",357,0,"2049-09-25",356,0,null,null,null,null,356,"2049-09-25",0,0,0,0,10000,"2049-09-25",357,0,"2049-09-25",356,0,null,null,null,"","","","","",54691,null,false,null,356,"2049-09-25",0,0,0,0]
[null,357,0,null,0,0,0,null,null,357,"2049-10-25",null,null,null,0,0,0,0,null,"2049-10-25",358,0,"2049-10-25",357,0,null,null,null,null,357,"2049-10-25",0,0,0,0,10000,"2049-10-25",358,0,"2049-10-25",357,0,null,null,null,"","","","","",54721,null,false,null,357,"2049-10-25",0,0,0,0]
[null,358,0,null,0,0,0,null,null,358,"2049-11-25",null,null,null,0,0,0,0,null,"2049-11-25",359,0,"2049-11-25",358,0,null,null,null,null,358,"2049-11-25",0,0,0,0,10000,"2049-11-25",359,0,"2049-11-25",358,0,null,null,null,"","","","","",54752,null,false,null,358,"2049-11-25",0,0,0,0]
[null,359,0,null,0,{"$f":"IF(B376>$B$13,0,IF(B376=$B$13,G375,C376-E376))","v":0},0,null,null,359,"2049-12-25",null,null,null,0,0,0,0,null,"2049-12-25",360,0,"2049-12-25",359,0,null,null,null,null,359,"2049-12-25",0,0,0,0,10000,"2049-12-25",360,0,"2049-12-25",359,0,null,null,null,"","","","","",54782,null,false,null,359,"2049-12-25",0,0,0,0]
[null,360,0,null,0,0,0,null,null,360,"2050-01-25",null,null,null,0,0,0,{"$f":"IF(J377>$B$13,0,R376-Q377)","v":0},null,"2050-01-25",361,0,"2050-01-25",360,0,null,null,null,null,360,"2050-01-25",0,0,0,0,10000,"2050-01-25",361,0,"2050-01-25",360,0,null,null,null,"","","","","",54813,null,false,null,360,"2050-01-25",0,0,0,0]
[null,null,{"$f":"SUM(C18:C377)","v":121412.23000000036},null,{"$f":"SUM(E18:E377)","v":21412.229999999996},{"$f":"SUM(F18:F377)","v":100000.00000000009},null,null,{"$f":"IF(H7=1,\"Échéance minorée - Un seul calcul intérêts possible = ''Exact/Année civile''\",IF(H7=0,\"Pas d'échéance brisée - Calcul intérêts en mois normalisé\",\"Intérêts calculés en ''Exact/Année civile''\nPas d'échéance zéro fictive (hors décret mai 2016)\"))","v":"Intérêts calculés en ''Exact/Année civile''\nPas d'échéance zéro fictive (hors décret mai 2016)"},null,null,null,null,null,{"$f":"SUM(O18:O377)","v":121525.01205479489},{"$f":"SUM(P18:P377)","v":21525.012054794519},{"$f":"SUM(Q18:Q377)","v":100000.00000000009},null,null,null,null,{"$f":"IRR(V16:V377)","v":1.6619005057378899E-3},null,null,{"$f":"IRR(Y17:Y377)","v":1.6766996838266657E-3},null,null,null,null,null,null,{"$f":"SUM(AF18:AF377)","v":121528.89000000036},{"$f":"SUM(AG18:AG377)+AG379","v":21528.890000000269},{"$f":"SUM(AH18:AH377)","v":100000.00000000009},null,{"$f":"MIN(AJ17:AJ377)","v":0},null,null,{"$f":"IRR(AM16:AM377)","v":1.6622418390144222E-3},null,null,{"$f":"IRR(AP17:AP377)","v":1.6770448420371231E-3},null,null,null,null,null,null,null,null,null,null,{"$f":"SUM(BA18:BA377)","v":506.91},null,null,null,{"$f":"SUM(BE18:BE377)","v":121528.89000000036},{"$f":"SUM(BF18:BF377)","v":21528.88995930061},{"$f":"SUM(BG18:BG377)","v":100000}]
[null,null,{"$f":"F378+E378","v":121412.23000000008},null,null,null,null,null,{"$f":"IF(H7=1,\"Échéance minorée - Un seul calcul intérêts possible = ''Exact/Année civile''\",IF(H7=0,\"Pas d'échéance brisée - Calcul intérêst en mois normalisé\",\"Echéance zéro fictive (= décret mai 2016) - Intérêts calculés en ''mois normalisé'' + ''Exact/Année civile'' pour jours résiduels\"))","v":"Echéance zéro fictive (= décret mai 2016) - Intérêts calculés en ''mois normalisé'' + ''Exact/Année civile'' pour jours résiduels"},null,null,null,null,null,{"$f":"Q378+P378","v":121525.01205479461},null,null,null,null,null,null,null,null,null,null,null,null,null,null,null,null,{"$f":"AH378+AG378","v":121528.89000000036},{"$f":"AF378-(SUM(AG18:AG377)+AH378)","v":1.7966666899155825E-2},null,null,null,null,null,null,null,null,null,null,null,null,null,null,null,null,null,null,null,null,null,null,null,{"$f":"BG378+BF378","v":121528.88995930061}]
[null,null,null,null,null,null,null,null,"Constantes"]
[null,null,null,null,null,null,null,null,"Variables"]
[]
[null,{"$f":"MAX(AT18:AT377)","v":240},{"$f":"MAX(AU18:AU377)","v":506.91},0.84,506.07000000009447,0]
[null,null,{"$f":"BA378","v":506.91}]
[]
[]
[null,null,null,null,null,null,null,null,null,null,null,null,null,null,null,null,null,null,null,null,null,null,null,null,null,null,null,null,null,null,null,null,null,null,{"$f":"AI17","v":100000}]
[null,null,null,null,null,null,null,null,null,null,null,null,null,null,null,null,null,null,null,null,null,null,null,null,null,null,null,null,null,{"$f":"AD18","v":1},null,{"$f":"IF($P$7=\"Oui\",ROUND(AE14,2),ROUND(AH18+AG18,2))","v":622.54},{"$f":"IF(AG14<>(AI17*$E$13/360*N18),AG14,AI17*$E$7/360*N18)","v":283.33333333333331},{"$f":"IF($P$7=\"Oui\",IF(AD18=$C$7,AI17,AF18-AG18),Q18)","v":339.21000000000004},{"$f":"IF(AD388>$C$7,0,AI387-AH388)","v":99660.79}]
[null,null,null,null,null,null,null,null,null,null,null,null,null,null,null,null,null,null,null,null,null,null,null,null,null,null,null,null,null,2,null,{"$f":"IF(AD19>$C$7,0,IF($P$7=\"Oui\",ROUND($AE$14,2),O19))","v":505.88},{"$f":"IF($P$7=\"Oui\",AI18*$AF$13/12,E19)","v":166.1},{"$f":"IF($P$7=\"Oui\",AF389-AG389,Q19)","v":339.78},99321.01]
[null,null,null,null,null,null,null,null,null,null,null,null,null,null,null,null,null,null,null,null,null,null,null,null,null,null,null,null,null,3,null,{"$f":"IF(AD20>$C$7,0,IF($P$7=\"Oui\",ROUND($AE$14,2),O20))","v":505.88},{"$f":"IF($P$7=\"Oui\",AI19*$AF$13/12,E20)","v":165.54},{"$f":"IF($P$7=\"Oui\",AF390-AG390,Q20)","v":340.34000000000003},98980.67]
[null,null,null,null,null,null,null,null,null,null,null,null,null,null,null,null,null,null,null,null,null,null,null,null,null,null,null,null,null,4,null,505.88,164.97,340.90999999999997,98639.76]
[null,null,null,null,null,null,null,null,null,null,null,null,null,null,null,null,null,null,null,null,null,null,null,null,null,null,null,null,null,5,null,505.88,164.4,341.48,98298.28]
[null,null,null,null,null,null,null,null,null,null,null,null,null,null,null,null,null,null,null,null,null,null,null,null,null,null,null,null,null,6,null,505.88,163.83000000000001,342.04999999999995,97956.23]
[null,null,null,null,null,null,null,null,null,null,null,null,null,null,null,null,null,null,null,null,null,null,null,null,null,null,null,null,null,7,null,505.88,163.26,342.62,97613.61]
[null,null,null,null,null,null,null,null,null,null,null,null,null,null,null,null,null,null,null,null,null,null,null,null,null,null,null,null,null,8,null,505.88,162.69,343.19,97270.42]
[null,null,null,null,null,null,null,null,null,null,null,null,null,null,null,null,null,null,null,null,null,null,null,null,null,null,null,null,null,9,null,505.88,162.12,343.76,96926.66]
[null,null,null,null,null,null,null,null,null,null,null,null,null,null,null,null,null,null,null,null,null,null,null,null,null,null,null,null,null,10,null,505.88,161.54,344.34000000000003,96582.32]
[null,null,null,null,null,null,null,null,null,null,null,null,null,null,null,null,null,null,null,null,null,null,null,null,null,null,null,null,null,11,null,505.88,160.97,344.90999999999997,96237.41]
[null,null,null,null,null,null,null,null,null,null,null,null,null,null,null,null,null,null,null,null,null,null,null,null,null,null,null,null,null,12,null,505.88,160.4,345.48,95891.930000000008]
[null,null,null,null,null,null,null,null,null,null,null,null,null,null,null,null,null,null,null,null,null,null,null,null,null,null,null,null,null,13,null,505.88,159.82,346.06,95545.87000000001]
[null,null,null,null,null,null,null,null,null,null,null,null,null,null,null,null,null,null,null,null,null,null,null,null,null,null,null,null,null,14,null,505.88,159.24,346.64,95199.23000000001]
[null,null,null,null,null,null,null,null,null,null,null,null,null,null,null,null,null,null,null,null,null,null,null,null,null,null,null,null,null,15,null,505.88,158.66999999999999,347.21000000000004,94852.02]
[null,null,null,null,null,null,null,null,null,null,null,null,null,null,null,null,null,null,null,null,null,null,null,null,null,null,null,null,null,16,null,505.88,158.09,347.78999999999996,94504.23000000001]
[null,null,null,null,null,null,null,null,null,null,null,null,null,null,null,null,null,null,null,null,null,null,null,null,null,null,null,null,null,17,null,505.88,157.51,348.37,94155.860000000015]
[null,null,null,null,null,null,null,null,null,null,null,null,null,null,null,null,null,null,null,null,null,null,null,null,null,null,null,null,null,18,null,505.88,156.93,348.95,93806.910000000018]
[null,null,null,null,null,null,null,null,null,null,null,null,null,null,null,null,null,null,null,null,null,null,null,null,null,null,null,null,null,19,null,505.88,156.34,349.53999999999996,93457.370000000024]
[null,null,null,null,null,null,null,null,null,null,null,null,null,null,null,null,null,null,null,null,null,null,null,null,null,null,null,null,null,20,null,505.88,155.76,350.12,93107.250000000029]
[null,null,null,null,null,null,null,null,null,null,null,null,null,null,null,null,null,null,null,null,null,null,null,null,null,null,null,null,null,21,null,505.88,155.18,350.7,92756.550000000032]
[null,null,null,null,null,null,null,null,null,null,null,null,null,null,null,null,null,null,null,null,null,null,null,null,null,null,null,null,null,22,null,505.88,154.59,351.28999999999996,92405.260000000038]
[null,null,null,null,null,null,null,null,null,null,null,null,null,null,null,null,null,null,null,null,null,null,null,null,null,null,null,null,null,23,null,505.88,154.01,351.87,92053.390000000043]
[null,null,null,null,null,null,null,null,null,null,null,null,null,null,null,null,null,null,null,null,null,null,null,null,null,null,null,null,null,24,null,505.88,153.41999999999999,352.46000000000004,91700.930000000037]
[null,null,null,null,null,null,null,null,null,null,null,null,null,null,null,null,null,null,null,null,null,null,null,null,null,null,null,null,null,25,null,505.88,152.83000000000001,353.04999999999995,91347.880000000034]
[null,null,null,null,null,null,null,null,null,null,null,null,null,null,null,null,null,null,null,null,null,null,null,null,null,null,null,null,null,26,null,505.88,152.25,353.63,90994.250000000029]
[null,null,null,null,null,null,null,null,null,null,null,null,null,null,null,null,null,null,null,null,null,null,null,null,null,null,null,null,null,27,null,505.88,151.66,354.22,90640.030000000028]
[null,null,null,null,null,null,null,null,null,null,null,null,null,null,null,null,null,null,null,null,null,null,null,null,null,null,null,null,null,28,null,505.88,151.07,354.81,90285.22000000003]
[null,null,null,null,null,null,null,null,null,null,null,null,null,null,null,null,null,null,null,null,null,null,null,null,null,null,null,null,null,29,null,505.88,150.47999999999999,355.4,89929.820000000036]
[null,null,null,null,null,null,null,null,null,null,null,null,null,null,null,null,null,null,null,null,null,null,null,null,null,null,null,null,null,30,null,505.88,149.88,356,89573.820000000036]
[null,null,null,null,null,null,null,null,null,null,null,null,null,null,null,null,null,null,null,null,null,null,null,null,null,null,null,null,null,31,null,505.88,149.29,356.59000000000003,89217.23000000004]
[null,null,null,null,null,null,null,null,null,null,null,null,null,null,null,null,null,null,null,null,null,null,null,null,null,null,null,null,null,32,null,505.88,148.69999999999999,357.18,88860.050000000047]
[null,null,null,null,null,null,null,null,null,null,null,null,null,null,null,null,null,null,null,null,null,null,null,null,null,null,null,null,null,33,null,505.88,148.1,357.78,88502.270000000048]
[null,null,null,null,null,null,null,null,null,null,null,null,null,null,null,null,null,null,null,null,null,null,null,null,null,null,null,null,null,34,null,505.88,147.5,358.38,88143.890000000043]
[null,null,null,null,null,null,null,null,null,null,null,null,null,null,null,null,null,null,null,null,null,null,null,null,null,null,null,null,null,35,null,505.88,146.91,358.97,87784.920000000042]
[null,null,null,null,null,null,null,null,null,null,null,null,null,null,null,null,null,null,null,null,null,null,null,null,null,null,null,null,null,36,null,505.88,146.31,359.57,87425.350000000035]
[null,null,null,null,null,null,null,null,null,null,null,null,null,null,null,null,null,null,null,null,null,null,null,null,null,null,null,null,null,37,null,505.88,145.71,360.16999999999996,87065.180000000037]
[null,null,null,null,null,null,null,null,null,null,null,null,null,null,null,null,null,null,null,null,null,null,null,null,null,null,null,null,null,38,null,505.88,145.11000000000001,360.77,86704.410000000033]
[null,null,null,null,null,null,null,null,null,null,null,null,null,null,null,null,null,null,null,null,null,null,null,null,null,null,null,null,null,39,null,505.88,144.51,361.37,86343.040000000037]
[null,null,null,null,null,null,null,null,null,null,null,null,null,null,null,null,null,null,null,null,null,null,null,null,null,null,null,null,null,40,null,505.88,143.91,361.97,85981.070000000036]
[null,null,null,null,null,null,null,null,null,null,null,null,null,null,null,null,null,null,null,null,null,null,null,null,null,null,null,null,null,41,null,505.88,143.30000000000001,362.58,85618.490000000034]
[null,null,null,null,null,null,null,null,null,null,null,null,null,null,null,null,null,null,null,null,null,null,null,null,null,null,null,null,null,42,null,505.88,142.69999999999999,363.18,85255.310000000041]
[null,null,null,null,null,null,null,null,null,null,null,null,null,null,null,null,null,null,null,null,null,null,null,null,null,null,null,null,null,43,null,505.88,142.09,363.78999999999996,84891.520000000048]
[null,null,null,null,null,null,null,null,null,null,null,null,null,null,null,null,null,null,null,null,null,null,null,null,null,null,null,null,null,44,null,505.88,141.49,364.39,84527.130000000048]
[null,null,null,null,null,null,null,null,null,null,null,null,null,null,null,null,null,null,null,null,null,null,null,null,null,null,null,null,null,45,null,505.88,140.88,365,84162.130000000048]
[null,null,null,null,null,null,null,null,null,null,null,null,null,null,null,null,null,null,null,null,null,null,null,null,null,null,null,null,null,46,null,505.88,140.27000000000001,365.61,83796.520000000048]
[null,null,null,null,null,null,null,null,null,null,null,null,null,null,null,null,null,null,null,null,null,null,null,null,null,null,null,null,null,47,null,505.88,139.66,366.22,83430.300000000047]
[null,null,null,null,null,null,null,null,null,null,null,null,null,null,null,null,null,null,null,null,null,null,null,null,null,null,null,null,null,48,null,505.88,139.05000000000001,366.83,83063.470000000045]
[null,null,null,null,null,null,null,null,null,null,null,null,null,null,null,null,null,null,null,null,null,null,null,null,null,null,null,null,null,49,null,505.88,138.44,367.44,82696.030000000042]
[null,null,null,null,null,null,null,null,null,null,null,null,null,null,null,null,null,null,null,null,null,null,null,null,null,null,null,null,null,50,null,505.88,137.83000000000001,368.04999999999995,82327.98000000004]
[null,null,null,null,null,null,null,null,null,null,null,null,null,null,null,null,null,null,null,null,null,null,null,null,null,null,null,null,null,51,null,505.88,137.21,368.66999999999996,81959.310000000041]
[null,null,null,null,null,null,null,null,null,null,null,null,null,null,null,null,null,null,null,null,null,null,null,null,null,null,null,null,null,52,null,505.88,136.6,369.28,81590.030000000042]
[null,null,null,null,null,null,null,null,null,null,null,null,null,null,null,null,null,null,null,null,null,null,null,null,null,null,null,null,null,53,null,505.88,135.97999999999999,369.9,81220.130000000048]
[null,null,null,null,null,null,null,null,null,null,null,null,null,null,null,null,null,null,null,null,null,null,null,null,null,null,null,null,null,54,null,505.88,135.37,370.51,80849.620000000054]
[null,null,null,null,null,null,null,null,null,null,null,null,null,null,null,null,null,null,null,null,null,null,null,null,null,null,null,null,null,55,null,505.88,134.75,371.13,80478.490000000049]
[null,null,null,null,null,null,null,null,null,null,null,null,null,null,null,null,null,null,null,null,null,null,null,null,null,null,null,null,null,56,null,505.88,134.13,371.75,80106.740000000049]
[null,null,null,null,null,null,null,null,null,null,null,null,null,null,null,null,null,null,null,null,null,null,null,null,null,null,null,null,null,57,null,505.88,133.51,372.37,79734.370000000054]
[null,null,null,null,null,null,null,null,null,null,null,null,null,null,null,null,null,null,null,null,null,null,null,null,null,null,null,null,null,58,null,505.88,132.88999999999999,372.99,79361.380000000048]
[null,null,null,null,null,null,null,null,null,null,null,null,null,null,null,null,null,null,null,null,null,null,null,null,null,null,null,null,null,59,null,505.88,132.27000000000001,373.61,78987.770000000048]
[null,null,null,null,null,null,null,null,null,null,null,null,null,null,null,null,null,null,null,null,null,null,null,null,null,null,null,null,null,60,null,505.88,131.65,374.23,78613.540000000052]
[null,null,null,null,null,null,null,null,null,null,null,null,null,null,null,null,null,null,null,null,null,null,null,null,null,null,null,null,null,61,null,505.88,131.02000000000001,374.86,78238.680000000051]
[null,null,null,null,null,null,null,null,null,null,null,null,null,null,null,null,null,null,null,null,null,null,null,null,null,null,null,null,null,62,null,505.88,130.4,375.48,77863.200000000055]
[null,null,null,null,null,null,null,null,null,null,null,null,null,null,null,null,null,null,null,null,null,null,null,null,null,null,null,null,null,63,null,505.88,129.77000000000001,376.11,77487.090000000055]
[null,null,null,null,null,null,null,null,null,null,null,null,null,null,null,null,null,null,null,null,null,null,null,null,null,null,null,null,null,64,null,505.88,129.15,376.73,77110.360000000059]
[null,null,null,null,null,null,null,null,null,null,null,null,null,null,null,null,null,null,null,null,null,null,null,null,null,null,null,null,null,65,null,505.88,128.52000000000001,377.36,{"$f":"IF(AD452>$C$7,0,AI451-AH452)","v":76733.000000000058}]
[null,null,null,null,null,null,null,null,null,null,null,null,null,null,null,null,null,null,null,null,null,null,null,null,null,null,null,null,null,66,null,505.88,127.89,377.99,76355.010000000053]
[null,null,null,null,null,null,null,null,null,null,null,null,null,null,null,null,null,null,null,null,null,null,null,null,null,null,null,null,null,67,null,{"$f":"IF(AD84>$C$7,0,IF($P$7=\"Oui\",ROUND($AE$14,2),O84))","v":505.88},{"$f":"IF($P$7=\"Oui\",AI83*$AF$13/12,E84)","v":127.26},{"$f":"IF($P$7=\"Oui\",AF454-AG454,Q84)","v":378.62},75976.390000000058]
[null,null,null,null,null,null,null,null,null,null,null,null,null,null,null,null,null,null,null,null,null,null,null,null,null,null,null,null,null,68,null,505.88,126.63,379.25,75597.140000000058]
[null,null,null,null,null,null,null,null,null,null,null,null,null,null,null,null,null,null,null,null,null,null,null,null,null,null,null,null,null,69,null,505.88,126,379.88,75217.260000000053]
[null,null,null,null,null,null,null,null,null,null,null,null,null,null,null,null,null,null,null,null,null,null,null,null,null,null,null,null,null,70,null,505.88,125.36,380.52,74836.740000000049]
[null,null,null,null,null,null,null,null,null,null,null,null,null,null,null,null,null,null,null,null,null,null,null,null,null,null,null,null,null,71,null,505.88,124.73,381.15,74455.590000000055]
[null,null,null,null,null,null,null,null,null,null,null,null,null,null,null,null,null,null,null,null,null,null,null,null,null,null,null,null,null,72,null,505.88,124.09,381.78999999999996,74073.800000000061]
[null,null,null,null,null,null,null,null,null,null,null,null,null,null,null,null,null,null,null,null,null,null,null,null,null,null,null,null,null,73,null,505.88,123.46,382.42,73691.380000000063]
[null,null,null,null,null,null,null,null,null,null,null,null,null,null,null,null,null,null,null,null,null,null,null,null,null,null,null,null,null,74,null,505.88,122.82,383.06,73308.320000000065]
[null,null,null,null,null,null,null,null,null,null,null,null,null,null,null,null,null,null,null,null,null,null,null,null,null,null,null,null,null,75,null,505.88,122.18,383.7,72924.620000000068]
[null,null,null,null,null,null,null,null,null,null,null,null,null,null,null,null,null,null,null,null,null,null,null,null,null,null,null,null,null,76,null,505.88,121.54,384.34,72540.280000000072]
[null,null,null,null,null,null,null,null,null,null,null,null,null,null,null,null,null,null,null,null,null,null,null,null,null,null,null,null,null,77,null,505.88,120.9,384.98,72155.300000000076]
[null,null,null,null,null,null,null,null,null,null,null,null,null,null,null,null,null,null,null,null,null,null,null,null,null,null,null,null,null,78,null,505.88,120.26,385.62,71769.68000000008]
[null,null,null,null,null,null,null,null,null,null,null,null,null,null,null,null,null,null,null,null,null,null,null,null,null,null,null,null,null,79,null,505.88,119.62,386.26,71383.420000000086]
[null,null,null,null,null,null,null,null,null,null,null,null,null,null,null,null,null,null,null,null,null,null,null,null,null,null,null,null,null,80,null,505.88,118.97,386.90999999999997,70996.510000000082]
[null,null,null,null,null,null,null,null,null,null,null,null,null,null,null,null,null,null,null,null,null,null,null,null,null,null,null,null,null,81,null,505.88,118.33,387.55,70608.960000000079]
[null,null,null,null,null,null,null,null,null,null,null,null,null,null,null,null,null,null,null,null,null,null,null,null,null,null,null,null,null,82,null,505.88,117.68,388.2,70220.760000000082]
[null,null,null,null,null,null,null,null,null,null,null,null,null,null,null,null,null,null,null,null,null,null,null,null,null,null,null,null,null,83,null,505.88,117.03,388.85,69831.910000000076]
[null,null,null,null,null,null,null,null,null,null,null,null,null,null,null,null,null,null,null,null,null,null,null,null,null,null,null,null,null,84,null,505.88,116.39,389.49,69442.420000000071]
[null,null,null,null,null,null,null,null,null,null,null,null,null,null,null,null,null,null,null,null,null,null,null,null,null,null,null,null,null,85,null,505.88,115.74,390.14,69052.280000000072]
[null,null,null,null,null,null,null,null,null,null,null,null,null,null,null,null,null,null,null,null,null,null,null,null,null,null,null,null,null,86,null,505.88,115.09,390.78999999999996,68661.490000000078]
[null,null,null,null,null,null,null,null,null,null,null,null,null,null,null,null,null,null,null,null,null,null,null,null,null,null,null,null,null,87,null,505.88,114.44,391.44,68270.050000000076]
[null,null,null,null,null,null,null,null,null,null,null,null,null,null,null,null,null,null,null,null,null,null,null,null,null,null,null,null,null,88,null,505.88,113.78,392.1,67877.95000000007]
[null,null,null,null,null,null,null,null,null,null,null,null,null,null,null,null,null,null,null,null,null,null,null,null,null,null,null,null,null,89,null,505.88,113.13,392.75,67485.20000000007]
[null,null,null,null,null,null,null,null,null,null,null,null,null,null,null,null,null,null,null,null,null,null,null,null,null,null,null,null,null,90,null,505.88,112.48,393.4,67091.800000000076]
[null,null,null,null,null,null,null,null,null,null,null,null,null,null,null,null,null,null,null,null,null,null,null,null,null,null,null,null,null,91,null,505.88,111.82,394.06,66697.740000000078]
[null,null,null,null,null,null,null,null,null,null,null,null,null,null,null,null,null,null,null,null,null,null,null,null,null,null,null,null,null,92,null,505.88,111.16,394.72,66303.020000000077]
[null,null,null,null,null,null,null,null,null,null,null,null,null,null,null,null,null,null,null,null,null,null,null,null,null,null,null,null,null,93,null,505.88,110.51,395.37,65907.650000000081]
[null,null,null,null,null,null,null,null,null,null,null,null,null,null,null,null,null,null,null,null,null,null,null,null,null,null,null,null,null,94,null,505.88,109.85,396.03,65511.620000000083]
[null,null,null,null,null,null,null,null,null,null,null,null,null,null,null,null,null,null,null,null,null,null,null,null,null,null,null,null,null,95,null,505.88,109.19,396.69,65114.93000000008]
[null,null,null,null,null,null,null,null,null,null,null,null,null,null,null,null,null,null,null,null,null,null,null,null,null,null,null,null,null,96,null,505.88,108.52,397.36,64717.57000000008]
[null,null,null,null,null,null,null,null,null,null,null,null,null,null,null,null,null,null,null,null,null,null,null,null,null,null,null,null,null,97,null,505.88,107.86,398.02,64319.550000000083]
[null,null,null,null,null,null,null,null,null,null,null,null,null,null,null,null,null,null,null,null,null,null,null,null,null,null,null,null,null,98,null,505.88,107.2,398.68,63920.870000000083]
[null,null,null,null,null,null,null,null,null,null,null,null,null,null,null,null,null,null,null,null,null,null,null,null,null,null,null,null,null,99,null,505.88,106.53,399.35,63521.520000000084]
[null,null,null,null,null,null,null,null,null,null,null,null,null,null,null,null,null,null,null,null,null,null,null,null,null,null,null,null,null,100,null,505.88,105.87,400.01,63121.510000000082]
[null,null,null,null,null,null,null,null,null,null,null,null,null,null,null,null,null,null,null,null,null,null,null,null,null,null,null,null,null,101,null,505.88,105.2,400.68,62720.830000000082]
[null,null,null,null,null,null,null,null,null,null,null,null,null,null,null,null,null,null,null,null,null,null,null,null,null,null,null,null,null,102,null,505.88,104.53,401.35,62319.480000000083]
[null,null,null,null,null,null,null,null,null,null,null,null,null,null,null,null,null,null,null,null,null,null,null,null,null,null,null,null,null,103,null,505.88,103.87,402.01,61917.470000000081]
[null,null,null,null,null,null,null,null,null,null,null,null,null,null,null,null,null,null,null,null,null,null,null,null,null,null,null,null,null,104,null,505.88,103.2,402.68,61514.790000000081]
[null,null,null,null,null,null,null,null,null,null,null,null,null,null,null,null,null,null,null,null,null,null,null,null,null,null,null,null,null,105,null,505.88,102.52,403.36,61111.43000000008]
[null,null,null,null,null,null,null,null,null,null,null,null,null,null,null,null,null,null,null,null,null,null,null,null,null,null,null,null,null,106,null,505.88,101.85,404.03,60707.400000000081]
[null,null,null,null,null,null,null,null,null,null,null,null,null,null,null,null,null,null,null,null,null,null,null,null,null,null,null,null,null,107,null,505.88,101.18,404.7,60302.700000000084]
[null,null,null,null,null,null,null,null,null,null,null,null,null,null,null,null,null,null,null,null,null,null,null,null,null,null,null,null,null,108,null,505.88,100.5,405.38,59897.320000000087]
[null,null,null,null,null,null,null,null,null,null,null,null,null,null,null,null,null,null,null,null,null,null,null,null,null,null,null,null,null,109,null,505.88,99.83,406.05,59491.270000000084]
[null,null,null,null,null,null,null,null,null,null,null,null,null,null,null,null,null,null,null,null,null,null,null,null,null,null,null,null,null,110,null,505.88,99.15,406.73,59084.540000000081]
[null,null,null,null,null,null,null,null,null,null,null,null,null,null,null,null,null,null,null,null,null,null,null,null,null,null,null,null,null,111,null,505.88,98.47,407.40999999999997,58677.130000000077]
[null,null,null,null,null,null,null,null,null,null,null,null,null,null,null,null,null,null,null,null,null,null,null,null,null,null,null,null,null,112,null,505.88,97.8,408.08,58269.050000000076]
[null,null,null,null,null,null,null,null,null,null,null,null,null,null,null,null,null,null,null,null,null,null,null,null,null,null,null,null,null,113,null,505.88,97.12,408.76,57860.290000000074]
[null,null,null,null,null,null,null,null,null,null,null,null,null,null,null,null,null,null,null,null,null,null,null,null,null,null,null,null,null,114,null,505.88,96.43,409.45,57450.840000000077]
[null,null,null,null,null,null,null,null,null,null,null,null,null,null,null,null,null,null,null,null,null,null,null,null,null,null,null,null,null,115,null,505.88,95.75,410.13,57040.710000000079]
[null,null,null,null,null,null,null,null,null,null,null,null,null,null,null,null,null,null,null,null,null,null,null,null,null,null,null,null,null,116,null,505.88,95.07,410.81,56629.900000000081]
[null,null,null,null,null,null,null,null,null,null,null,null,null,null,null,null,null,null,null,null,null,null,null,null,null,null,null,null,null,117,null,505.88,94.38,411.5,56218.400000000081]
[null,null,null,null,null,null,null,null,null,null,null,null,null,null,null,null,null,null,null,null,null,null,null,null,null,null,null,null,null,118,null,505.88,93.7,412.18,55806.220000000081]
[null,null,null,null,null,null,null,null,null,null,null,null,null,null,null,null,null,null,null,null,null,null,null,null,null,null,null,null,null,119,null,505.88,93.01,412.87,55393.350000000079]
[null,null,null,null,null,null,null,null,null,null,null,null,null,null,null,null,null,null,null,null,null,null,null,null,null,null,null,null,null,120,null,505.88,92.32,413.56,54979.790000000081]
[null,null,null,null,null,null,null,null,null,null,null,null,null,null,null,null,null,null,null,null,null,null,null,null,null,null,null,null,null,121,null,505.88,91.63,414.25,54565.540000000081]
[null,null,null,null,null,null,null,null,null,null,null,null,null,null,null,null,null,null,null,null,null,null,null,null,null,null,null,null,null,122,null,505.88,90.94,414.94,54150.600000000079]
[null,null,null,null,null,null,null,null,null,null,null,null,null,null,null,null,null,null,null,null,null,null,null,null,null,null,null,null,null,123,null,505.88,90.25,415.63,53734.970000000081]
[null,null,null,null,null,null,null,null,null,null,null,null,null,null,null,null,null,null,null,null,null,null,null,null,null,null,null,null,null,124,null,505.88,89.56,416.32,53318.650000000081]
[null,null,null,null,null,null,null,null,null,null,null,null,null,null,null,null,null,null,null,null,null,null,null,null,null,null,null,null,null,125,null,505.88,88.86,417.02,52901.630000000085]
[null,null,null,null,null,null,null,null,null,null,null,null,null,null,null,null,null,null,null,null,null,null,null,null,null,null,null,null,null,126,null,505.88,88.17,417.71,52483.920000000086]
[null,null,null,null,null,null,null,null,null,null,null,null,null,null,null,null,null,null,null,null,null,null,null,null,null,null,null,null,null,127,null,505.88,87.47,418.40999999999997,52065.510000000082]
[null,null,null,null,null,null,null,null,null,null,null,null,null,null,null,null,null,null,null,null,null,null,null,null,null,null,null,null,null,128,null,505.88,86.78,419.1,51646.410000000084]
[null,null,null,null,null,null,null,null,null,null,null,null,null,null,null,null,null,null,null,null,null,null,null,null,null,null,null,null,null,129,null,505.88,86.08,419.8,{"$f":"IF(AD516>$C$7,0,AI515-AH516)","v":51226.610000000081}]
[null,null,null,null,null,null,null,null,null,null,null,null,null,null,null,null,null,null,null,null,null,null,null,null,null,null,null,null,null,130,null,505.88,85.38,420.5,50806.110000000081]
[null,null,null,null,null,null,null,null,null,null,null,null,null,null,null,null,null,null,null,null,null,null,null,null,null,null,null,null,null,131,null,{"$f":"IF(AD148>$C$7,0,IF($P$7=\"Oui\",ROUND($AE$14,2),O148))","v":505.88},{"$f":"IF($P$7=\"Oui\",AI147*$AF$13/12,E148)","v":84.68},{"$f":"IF($P$7=\"Oui\",AF518-AG518,Q148)","v":421.2},50384.910000000084]
[null,null,null,null,null,null,null,null,null,null,null,null,null,null,null,null,null,null,null,null,null,null,null,null,null,null,null,null,null,132,null,505.88,83.97,421.90999999999997,49963.00000000008]
[null,null,null,null,null,null,null,null,null,null,null,null,null,null,null,null,null,null,null,null,null,null,null,null,null,null,null,null,null,133,null,505.88,83.27,422.61,49540.390000000079]
[null,null,null,null,null,null,null,null,null,null,null,null,null,null,null,null,null,null,null,null,null,null,null,null,null,null,null,null,null,134,null,505.88,82.57,423.31,49117.080000000082]
[null,null,null,null,null,null,null,null,null,null,null,null,null,null,null,null,null,null,null,null,null,null,null,null,null,null,null,null,null,135,null,505.88,81.86,424.02,48693.060000000085]
[null,null,null,null,null,null,null,null,null,null,null,null,null,null,null,null,null,null,null,null,null,null,null,null,null,null,null,null,null,136,null,505.88,81.16,424.72,48268.340000000084]
[null,null,null,null,null,null,null,null,null,null,null,null,null,null,null,null,null,null,null,null,null,null,null,null,null,null,null,null,null,137,null,505.88,80.45,425.43,47842.910000000084]
[null,null,null,null,null,null,null,null,null,null,null,null,null,null,null,null,null,null,null,null,null,null,null,null,null,null,null,null,null,138,null,505.88,79.739999999999995,426.14,47416.770000000084]
[null,null,null,null,null,null,null,null,null,null,null,null,null,null,null,null,null,null,null,null,null,null,null,null,null,null,null,null,null,139,null,505.88,79.03,426.85,46989.920000000086]
[null,null,null,null,null,null,null,null,null,null,null,null,null,null,null,null,null,null,null,null,null,null,null,null,null,null,null,null,null,140,null,505.88,78.319999999999993,427.56,46562.360000000088]
[null,null,null,null,null,null,null,null,null,null,null,null,null,null,null,null,null,null,null,null,null,null,null,null,null,null,null,null,null,141,null,505.88,77.599999999999994,428.28,46134.080000000089]
[null,null,null,null,null,null,null,null,null,null,null,null,null,null,null,null,null,null,null,null,null,null,null,null,null,null,null,null,null,142,null,505.88,76.89,428.99,45705.090000000091]
[null,null,null,null,null,null,null,null,null,null,null,null,null,null,null,null,null,null,null,null,null,null,null,null,null,null,null,null,null,143,null,505.88,76.180000000000007,429.7,45275.390000000094]
[null,null,null,null,null,null,null,null,null,null,null,null,null,null,null,null,null,null,null,null,null,null,null,null,null,null,null,null,null,144,null,505.88,75.459999999999994,430.42,44844.970000000096]
[null,null,null,null,null,null,null,null,null,null,null,null,null,null,null,null,null,null,null,null,null,null,null,null,null,null,null,null,null,145,null,505.88,74.739999999999995,431.14,44413.830000000096]
[null,null,null,null,null,null,null,null,null,null,null,null,null,null,null,null,null,null,null,null,null,null,null,null,null,null,null,null,null,146,null,505.88,74.02,431.86,43981.970000000096]
[null,null,null,null,null,null,null,null,null,null,null,null,null,null,null,null,null,null,null,null,null,null,null,null,null,null,null,null,null,147,null,505.88,73.3,432.58,43549.390000000094]
[null,null,null,null,null,null,null,null,null,null,null,null,null,null,null,null,null,null,null,null,null,null,null,null,null,null,null,null,null,148,null,505.88,72.58,433.3,43116.090000000091]
[null,null,null,null,null,null,null,null,null,null,null,null,null,null,null,null,null,null,null,null,null,null,null,null,null,null,null,null,null,149,null,505.88,71.86,434.02,42682.070000000094]
[null,null,null,null,null,null,null,null,null,null,null,null,null,null,null,null,null,null,null,null,null,null,null,null,null,null,null,null,null,150,null,505.88,71.14,434.74,42247.330000000096]
[null,null,null,null,null,null,null,null,null,null,null,null,null,null,null,null,null,null,null,null,null,null,null,null,null,null,null,null,null,151,null,505.88,70.41,435.47,41811.860000000095]
[null,null,null,null,null,null,null,null,null,null,null,null,null,null,null,null,null,null,null,null,null,null,null,null,null,null,null,null,null,152,null,505.88,69.69,436.19,41375.670000000093]
[null,null,null,null,null,null,null,null,null,null,null,null,null,null,null,null,null,null,null,null,null,null,null,null,null,null,null,null,null,153,null,505.88,68.959999999999994,436.92,40938.750000000095]
[null,null,null,null,null,null,null,null,null,null,null,null,null,null,null,null,null,null,null,null,null,null,null,null,null,null,null,null,null,154,null,505.88,68.23,437.65,40501.100000000093]
[null,null,null,null,null,null,null,null,null,null,null,null,null,null,null,null,null,null,null,null,null,null,null,null,null,null,null,null,null,155,null,505.88,67.5,438.38,40062.720000000096]
[null,null,null,null,null,null,null,null,null,null,null,null,null,null,null,null,null,null,null,null,null,null,null,null,null,null,null,null,null,156,null,505.88,66.77,439.11,39623.610000000095]
[null,null,null,null,null,null,null,null,null,null,null,null,null,null,null,null,null,null,null,null,null,null,null,null,null,null,null,null,null,157,null,505.88,66.040000000000006,439.84,39183.770000000099]
[null,null,null,null,null,null,null,null,null,null,null,null,null,null,null,null,null,null,null,null,null,null,null,null,null,null,null,null,null,158,null,505.88,65.31,440.57,38743.200000000099]
[null,null,null,null,null,null,null,null,null,null,null,null,null,null,null,null,null,null,null,null,null,null,null,null,null,null,null,null,null,159,null,505.88,64.569999999999993,441.31,38301.890000000101]
[null,null,null,null,null,null,null,null,null,null,null,null,null,null,null,null,null,null,null,null,null,null,null,null,null,null,null,null,null,160,null,505.88,63.84,442.03999999999996,37859.8500000001]
[null,null,null,null,null,null,null,null,null,null,null,null,null,null,null,null,null,null,null,null,null,null,null,null,null,null,null,null,null,161,null,505.88,63.1,442.78,37417.070000000102]
[null,null,null,null,null,null,null,null,null,null,null,null,null,null,null,null,null,null,null,null,null,null,null,null,null,null,null,null,null,162,null,505.88,62.36,443.52,36973.550000000105]
[null,null,null,null,null,null,null,null,null,null,null,null,null,null,null,null,null,null,null,null,null,null,null,null,null,null,null,null,null,163,null,505.88,61.62,444.26,36529.290000000103]
[null,null,null,null,null,null,null,null,null,null,null,null,null,null,null,null,null,null,null,null,null,null,null,null,null,null,null,null,null,164,null,505.88,60.88,445,36084.290000000103]
[null,null,null,null,null,null,null,null,null,null,null,null,null,null,null,null,null,null,null,null,null,null,null,null,null,null,null,null,null,165,null,505.88,60.14,445.74,35638.550000000105]
[null,null,null,null,null,null,null,null,null,null,null,null,null,null,null,null,null,null,null,null,null,null,null,null,null,null,null,null,null,166,null,505.88,59.4,446.48,35192.070000000102]
[null,null,null,null,null,null,null,null,null,null,null,null,null,null,null,null,null,null,null,null,null,null,null,null,null,null,null,null,null,167,null,505.88,58.65,447.23,34744.840000000098]
[null,null,null,null,null,null,null,null,null,null,null,null,null,null,null,null,null,null,null,null,null,null,null,null,null,null,null,null,null,168,null,505.88,57.91,447.97,34296.870000000097]
[null,null,null,null,null,null,null,null,null,null,null,null,null,null,null,null,null,null,null,null,null,null,null,null,null,null,null,null,null,169,null,505.88,57.16,448.72,33848.150000000096]
[null,null,null,null,null,null,null,null,null,null,null,null,null,null,null,null,null,null,null,null,null,null,null,null,null,null,null,null,null,170,null,505.88,56.41,449.47,33398.680000000095]
[null,null,null,null,null,null,null,null,null,null,null,null,null,null,null,null,null,null,null,null,null,null,null,null,null,null,null,null,null,171,null,505.88,55.66,450.22,32948.460000000094]
[null,null,null,null,null,null,null,null,null,null,null,null,null,null,null,null,null,null,null,null,null,null,null,null,null,null,null,null,null,172,null,505.88,54.91,450.97,32497.490000000093]
[null,null,null,null,null,null,null,null,null,null,null,null,null,null,null,null,null,null,null,null,null,null,null,null,null,null,null,null,null,173,null,505.88,54.16,451.72,32045.770000000091]
[null,null,null,null,null,null,null,null,null,null,null,null,null,null,null,null,null,null,null,null,null,null,null,null,null,null,null,null,null,174,null,505.88,53.41,452.47,31593.30000000009]
[null,null,null,null,null,null,null,null,null,null,null,null,null,null,null,null,null,null,null,null,null,null,null,null,null,null,null,null,null,175,null,505.88,52.66,453.22,31140.080000000089]
[null,null,null,null,null,null,null,null,null,null,null,null,null,null,null,null,null,null,null,null,null,null,null,null,null,null,null,null,null,176,null,505.88,51.9,453.98,30686.100000000089]
[null,null,null,null,null,null,null,null,null,null,null,null,null,null,null,null,null,null,null,null,null,null,null,null,null,null,null,null,null,177,null,505.88,51.14,454.74,30231.360000000088]
[null,null,null,null,null,null,null,null,null,null,null,null,null,null,null,null,null,null,null,null,null,null,null,null,null,null,null,null,null,178,null,505.88,50.39,455.49,29775.870000000086]
[null,null,null,null,null,null,null,null,null,null,null,null,null,null,null,null,null,null,null,null,null,null,null,null,null,null,null,null,null,179,null,505.88,49.63,456.25,29319.620000000086]
[null,null,null,null,null,null,null,null,null,null,null,null,null,null,null,null,null,null,null,null,null,null,null,null,null,null,null,null,null,180,null,505.88,48.87,457.01,28862.610000000088]
[null,null,null,null,null,null,null,null,null,null,null,null,null,null,null,null,null,null,null,null,null,null,null,null,null,null,null,null,null,181,null,505.88,48.1,457.78,28404.830000000089]
[null,null,null,null,null,null,null,null,null,null,null,null,null,null,null,null,null,null,null,null,null,null,null,null,null,null,null,null,null,182,null,505.88,47.34,458.53999999999996,27946.290000000088]
[null,null,null,null,null,null,null,null,null,null,null,null,null,null,null,null,null,null,null,null,null,null,null,null,null,null,null,null,null,183,null,505.88,46.58,459.3,27486.990000000089]
[null,null,null,null,null,null,null,null,null,null,null,null,null,null,null,null,null,null,null,null,null,null,null,null,null,null,null,null,null,184,null,505.88,45.81,460.07,27026.920000000089]
[null,null,null,null,null,null,null,null,null,null,null,null,null,null,null,null,null,null,null,null,null,null,null,null,null,null,null,null,null,185,null,505.88,45.04,460.84,26566.080000000089]
[null,null,null,null,null,null,null,null,null,null,null,null,null,null,null,null,null,null,null,null,null,null,null,null,null,null,null,null,null,186,null,505.88,44.28,461.6,26104.480000000091]
[null,null,null,null,null,null,null,null,null,null,null,null,null,null,null,null,null,null,null,null,null,null,null,null,null,null,null,null,null,187,null,505.88,43.51,462.37,25642.110000000092]
[null,null,null,null,null,null,null,null,null,null,null,null,null,null,null,null,null,null,null,null,null,null,null,null,null,null,null,null,null,188,null,505.88,42.74,463.14,25178.970000000092]
[null,null,null,null,null,null,null,null,null,null,null,null,null,null,null,null,null,null,null,null,null,null,null,null,null,null,null,null,null,189,null,505.88,41.96,463.92,24715.050000000094]
[null,null,null,null,null,null,null,null,null,null,null,null,null,null,null,null,null,null,null,null,null,null,null,null,null,null,null,null,null,190,null,505.88,41.19,464.69,24250.360000000095]
[null,null,null,null,null,null,null,null,null,null,null,null,null,null,null,null,null,null,null,null,null,null,null,null,null,null,null,null,null,191,null,505.88,40.42,465.46,23784.900000000096]
[null,null,null,null,null,null,null,null,null,null,null,null,null,null,null,null,null,null,null,null,null,null,null,null,null,null,null,null,null,192,null,505.88,39.64,466.24,23318.660000000094]
[null,null,null,null,null,null,null,null,null,null,null,null,null,null,null,null,null,null,null,null,null,null,null,null,null,null,null,null,null,193,null,505.88,38.86,467.02,{"$f":"IF(AD580>$C$7,0,AI579-AH580)","v":22851.640000000094}]
[null,null,null,null,null,null,null,null,null,null,null,null,null,null,null,null,null,null,null,null,null,null,null,null,null,null,null,null,null,194,null,505.88,38.090000000000003,467.78999999999996,22383.850000000093]
[null,null,null,null,null,null,null,null,null,null,null,null,null,null,null,null,null,null,null,null,null,null,null,null,null,null,null,null,null,195,null,{"$f":"IF(AD212>$C$7,0,IF($P$7=\"Oui\",ROUND($AE$14,2),O212))","v":505.88},{"$f":"IF($P$7=\"Oui\",AI211*$AF$13/12,E212)","v":37.31},{"$f":"IF($P$7=\"Oui\",AF582-AG582,Q212)","v":468.57},21915.280000000093]
[null,null,null,null,null,null,null,null,null,null,null,null,null,null,null,null,null,null,null,null,null,null,null,null,null,null,null,null,null,196,null,505.88,36.53,469.35,21445.930000000095]
[null,null,null,null,null,null,null,null,null,null,null,null,null,null,null,null,null,null,null,null,null,null,null,null,null,null,null,null,null,197,null,505.88,35.74,470.14,20975.790000000095]
[null,null,null,null,null,null,null,null,null,null,null,null,null,null,null,null,null,null,null,null,null,null,null,null,null,null,null,null,null,198,null,505.88,34.96,470.92,20504.870000000097]
[null,null,null,null,null,null,null,null,null,null,null,null,null,null,null,null,null,null,null,null,null,null,null,null,null,null,null,null,null,199,null,505.88,34.17,471.71,20033.160000000098]
[null,null,null,null,null,null,null,null,null,null,null,null,null,null,null,null,null,null,null,null,null,null,null,null,null,null,null,null,null,200,null,505.88,33.39,472.49,19560.670000000096]
[null,null,null,null,null,null,null,null,null,null,null,null,null,null,null,null,null,null,null,null,null,null,null,null,null,null,null,null,null,201,null,505.88,32.6,473.28,19087.390000000098]
[null,null,null,null,null,null,null,null,null,null,null,null,null,null,null,null,null,null,null,null,null,null,null,null,null,null,null,null,null,202,null,505.88,31.81,474.07,18613.320000000098]
[null,null,null,null,null,null,null,null,null,null,null,null,null,null,null,null,null,null,null,null,null,null,null,null,null,null,null,null,null,203,null,505.88,31.02,474.86,18138.460000000097]
[null,null,null,null,null,null,null,null,null,null,null,null,null,null,null,null,null,null,null,null,null,null,null,null,null,null,null,null,null,204,null,505.88,30.23,475.65,17662.810000000096]
[null,null,null,null,null,null,null,null,null,null,null,null,null,null,null,null,null,null,null,null,null,null,null,null,null,null,null,null,null,205,null,505.88,29.44,476.44,17186.370000000097]
[null,null,null,null,null,null,null,null,null,null,null,null,null,null,null,null,null,null,null,null,null,null,null,null,null,null,null,null,null,206,null,505.88,28.64,477.24,16709.130000000096]
[null,null,null,null,null,null,null,null,null,null,null,null,null,null,null,null,null,null,null,null,null,null,null,null,null,null,null,null,null,207,null,505.88,27.85,478.03,16231.100000000095]
[null,null,null,null,null,null,null,null,null,null,null,null,null,null,null,null,null,null,null,null,null,null,null,null,null,null,null,null,null,208,null,505.88,27.05,478.83,15752.270000000095]
[null,null,null,null,null,null,null,null,null,null,null,null,null,null,null,null,null,null,null,null,null,null,null,null,null,null,null,null,null,209,null,505.88,26.25,479.63,15272.640000000096]
[null,null,null,null,null,null,null,null,null,null,null,null,null,null,null,null,null,null,null,null,null,null,null,null,null,null,null,null,null,210,null,505.88,25.45,480.43,14792.210000000096]
[null,null,null,null,null,null,null,null,null,null,null,null,null,null,null,null,null,null,null,null,null,null,null,null,null,null,null,null,null,211,null,505.88,24.65,481.23,14310.980000000096]
[null,null,null,null,null,null,null,null,null,null,null,null,null,null,null,null,null,null,null,null,null,null,null,null,null,null,null,null,null,212,null,505.88,23.85,482.03,13828.950000000095]
[null,null,null,null,null,null,null,null,null,null,null,null,null,null,null,null,null,null,null,null,null,null,null,null,null,null,null,null,null,213,null,505.88,23.05,482.83,13346.120000000095]
[null,null,null,null,null,null,null,null,null,null,null,null,null,null,null,null,null,null,null,null,null,null,null,null,null,null,null,null,null,214,null,505.88,22.24,483.64,12862.480000000096]
[null,null,null,null,null,null,null,null,null,null,null,null,null,null,null,null,null,null,null,null,null,null,null,null,null,null,null,null,null,215,null,505.88,21.44,484.44,12378.040000000095]
[null,null,null,null,null,null,null,null,null,null,null,null,null,null,null,null,null,null,null,null,null,null,null,null,null,null,null,null,null,216,null,505.88,20.63,485.25,11892.790000000095]
[null,null,null,null,null,null,null,null,null,null,null,null,null,null,null,null,null,null,null,null,null,null,null,null,null,null,null,null,null,217,null,505.88,19.82,486.06,11406.730000000096]
[null,null,null,null,null,null,null,null,null,null,null,null,null,null,null,null,null,null,null,null,null,null,null,null,null,null,null,null,null,218,null,505.88,19.010000000000002,486.87,10919.860000000095]
[null,null,null,null,null,null,null,null,null,null,null,null,null,null,null,null,null,null,null,null,null,null,null,null,null,null,null,null,null,219,null,505.88,18.2,487.68,10432.180000000095]
[null,null,null,null,null,null,null,null,null,null,null,null,null,null,null,null,null,null,null,null,null,null,null,null,null,null,null,null,null,220,null,505.88,17.39,488.49,9943.6900000000951]
[null,null,null,null,null,null,null,null,null,null,null,null,null,null,null,null,null,null,null,null,null,null,null,null,null,null,null,null,null,221,null,505.88,16.57,489.31,9454.3800000000956]
[null,null,null,null,null,null,null,null,null,null,null,null,null,null,null,null,null,null,null,null,null,null,null,null,null,null,null,null,null,222,null,505.88,15.76,490.12,8964.2600000000948]
[null,null,null,null,null,null,null,null,null,null,null,null,null,null,null,null,null,null,null,null,null,null,null,null,null,null,null,null,null,223,null,505.88,14.94,490.94,8473.3200000000943]
[null,null,null,null,null,null,null,null,null,null,null,null,null,null,null,null,null,null,null,null,null,null,null,null,null,null,null,null,null,224,null,505.88,14.12,491.76,7981.5600000000941]
[null,null,null,null,null,null,null,null,null,null,null,null,null,null,null,null,null,null,null,null,null,null,null,null,null,null,null,null,null,225,null,505.88,13.3,492.58,7488.9800000000942]
[null,null,null,null,null,null,null,null,null,null,null,null,null,null,null,null,null,null,null,null,null,null,null,null,null,null,null,null,null,226,null,505.88,12.48,493.4,6995.5800000000945]
[null,null,null,null,null,null,null,null,null,null,null,null,null,null,null,null,null,null,null,null,null,null,null,null,null,null,null,null,null,227,null,505.88,11.66,494.21999999999997,6501.3600000000943]
[null,null,null,null,null,null,null,null,null,null,null,null,null,null,null,null,null,null,null,null,null,null,null,null,null,null,null,null,null,228,null,505.88,10.84,495.04,6006.3200000000943]
[null,null,null,null,null,null,null,null,null,null,null,null,null,null,null,null,null,null,null,null,null,null,null,null,null,null,null,null,null,229,null,505.88,10.01,495.87,5510.4500000000944]
[null,null,null,null,null,null,null,null,null,null,null,null,null,null,null,null,null,null,null,null,null,null,null,null,null,null,null,null,null,230,null,505.88,9.18,496.7,5013.7500000000946]
[null,null,null,null,null,null,null,null,null,null,null,null,null,null,null,null,null,null,null,null,null,null,null,null,null,null,null,null,null,231,null,505.88,8.36,497.52,4516.2300000000942]
[null,null,null,null,null,null,null,null,null,null,null,null,null,null,null,null,null,null,null,null,null,null,null,null,null,null,null,null,null,232,null,505.88,7.53,498.35,4017.8800000000942]
[null,null,null,null,null,null,null,null,null,null,null,null,null,null,null,null,null,null,null,null,null,null,null,null,null,null,null,null,null,233,null,505.88,6.7,499.18,3518.7000000000944]
[null,null,null,null,null,null,null,null,null,null,null,null,null,null,null,null,null,null,null,null,null,null,null,null,null,null,null,null,null,234,null,505.88,5.86,500.02,3018.6800000000944]
[null,null,null,null,null,null,null,null,null,null,null,null,null,null,null,null,null,null,null,null,null,null,null,null,null,null,null,null,null,235,null,505.88,5.03,500.85,2517.8300000000945]
[null,null,null,null,null,null,null,null,null,null,null,null,null,null,null,null,null,null,null,null,null,null,null,null,null,null,null,null,null,236,null,505.88,4.2,501.68,2016.1500000000945]
[null,null,null,null,null,null,null,null,null,null,null,null,null,null,null,null,null,null,null,null,null,null,null,null,null,null,null,null,null,237,null,505.88,3.36,502.52,1513.6300000000945]
[null,null,null,null,null,null,null,null,null,null,null,null,null,null,null,null,null,null,null,null,null,null,null,null,null,null,null,null,null,238,null,505.88,2.52,503.36,1010.2700000000945]
[null,null,null,null,null,null,null,null,null,null,null,null,null,null,null,null,null,null,null,null,null,null,null,null,null,null,null,null,null,239,null,505.88,1.68,504.2,506.07000000009447]
[null,null,null,null,null,null,null,null,null,null,null,null,null,null,null,null,null,null,null,null,null,null,null,null,null,null,null,null,null,240,null,506.91,0.84,506.07000000009447,0]
[null,null,null,null,null,null,null,null,null,null,null,null,null,null,null,null,null,null,null,null,null,null,null,null,null,null,null,null,null,241,null,0,0,0,{"$f":"IF(AD628>$C$7,0,AI627-AH628)","v":0}]
[null,null,null,null,null,null,null,null,null,null,null,null,null,null,null,null,null,null,null,null,null,null,null,null,null,null,null,null,null,242,null,0,0,0,{"$f":"IF(AD629>$C$7,0,AI628-AH629)","v":0}]
[null,null,null,null,null,null,null,null,null,null,null,null,null,null,null,null,null,null,null,null,null,null,null,null,null,null,null,null,null,243,null,0,0,0,0]
[null,null,null,null,null,null,null,null,null,null,null,null,null,null,null,null,null,null,null,null,null,null,null,null,null,null,null,null,null,244,null,0,0,0,0]
[null,null,null,null,null,null,null,null,null,null,null,null,null,null,null,null,null,null,null,null,null,null,null,null,null,null,null,null,null,245,null,0,0,0,0]
[null,null,null,null,null,null,null,null,null,null,null,null,null,null,null,null,null,null,null,null,null,null,null,null,null,null,null,null,null,246,null,0,0,0,0]
[null,null,null,null,null,null,null,null,null,null,null,null,null,null,null,null,null,null,null,null,null,null,null,null,null,null,null,null,null,247,null,0,0,0,0]
[null,null,null,null,null,null,null,null,null,null,null,null,null,null,null,null,null,null,null,null,null,null,null,null,null,null,null,null,null,248,null,0,0,0,0]
[null,null,null,null,null,null,null,null,null,null,null,null,null,null,null,null,null,null,null,null,null,null,null,null,null,null,null,null,null,249,null,0,0,0,0]
[null,null,null,null,null,null,null,null,null,null,null,null,null,null,null,null,null,null,null,null,null,null,null,null,null,null,null,null,null,250,null,0,0,0,0]
[null,null,null,null,null,null,null,null,null,null,null,null,null,null,null,null,null,null,null,null,null,null,null,null,null,null,null,null,null,251,null,0,0,0,0]
[null,null,null,null,null,null,null,null,null,null,null,null,null,null,null,null,null,null,null,null,null,null,null,null,null,null,null,null,null,252,null,0,0,0,0]
[null,null,null,null,null,null,null,null,null,null,null,null,null,null,null,null,null,null,null,null,null,null,null,null,null,null,null,null,null,253,null,0,0,0,0]
[null,null,null,null,null,null,null,null,null,null,null,null,null,null,null,null,null,null,null,null,null,null,null,null,null,null,null,null,null,254,null,0,0,0,0]
[null,null,null,null,null,null,null,null,null,null,null,null,null,null,null,null,null,null,null,null,null,null,null,null,null,null,null,null,null,255,null,0,0,0,0]
[null,null,null,null,null,null,null,null,null,null,null,null,null,null,null,null,null,null,null,null,null,null,null,null,null,null,null,null,null,256,null,0,0,0,0]
[null,null,null,null,null,null,null,null,null,null,null,null,null,null,null,null,null,null,null,null,null,null,null,null,null,null,null,null,null,257,null,0,0,0,0]
[null,null,null,null,null,null,null,null,null,null,null,null,null,null,null,null,null,null,null,null,null,null,null,null,null,null,null,null,null,258,null,0,0,0,0]
[null,null,null,null,null,null,null,null,null,null,null,null,null,null,null,null,null,null,null,null,null,null,null,null,null,null,null,null,null,259,null,{"$f":"IF(AD276>$C$7,0,IF($P$7=\"Oui\",ROUND($AE$14,2),O276))","v":0},{"$f":"IF($P$7=\"Oui\",AI275*$AF$13/12,E276)","v":0},{"$f":"IF($P$7=\"Oui\",AF646-AG646,Q276)","v":0},0]
[null,null,null,null,null,null,null,null,null,null,null,null,null,null,null,null,null,null,null,null,null,null,null,null,null,null,null,null,null,260,null,0,0,0,0]
[null,null,null,null,null,null,null,null,null,null,null,null,null,null,null,null,null,null,null,null,null,null,null,null,null,null,null,null,null,261,null,0,0,0,0]
[null,null,null,null,null,null,null,null,null,null,null,null,null,null,null,null,null,null,null,null,null,null,null,null,null,null,null,null,null,262,null,0,0,0,0]
[null,null,null,null,null,null,null,null,null,null,null,null,null,null,null,null,null,null,null,null,null,null,null,null,null,null,null,null,null,263,null,0,0,0,0]
[null,null,null,null,null,null,null,null,null,null,null,null,null,null,null,null,null,null,null,null,null,null,null,null,null,null,null,null,null,264,null,0,0,0,0]
[null,null,null,null,null,null,null,null,null,null,null,null,null,null,null,null,null,null,null,null,null,null,null,null,null,null,null,null,null,265,null,0,0,0,0]
[null,null,null,null,null,null,null,null,null,null,null,null,null,null,null,null,null,null,null,null,null,null,null,null,null,null,null,null,null,266,null,0,0,0,0]
[null,null,null,null,null,null,null,null,null,null,null,null,null,null,null,null,null,null,null,null,null,null,null,null,null,null,null,null,null,267,null,0,0,0,0]
[null,null,null,null,null,null,null,null,null,null,null,null,null,null,null,null,null,null,null,null,null,null,null,null,null,null,null,null,null,268,null,0,0,0,0]
[null,null,null,null,null,null,null,null,null,null,null,null,null,null,null,null,null,null,null,null,null,null,null,null,null,null,null,null,null,269,null,0,0,0,0]
[null,null,null,null,null,null,null,null,null,null,null,null,null,null,null,null,null,null,null,null,null,null,null,null,null,null,null,null,null,270,null,0,0,0,0]
[null,null,null,null,null,null,null,null,null,null,null,null,null,null,null,null,null,null,null,null,null,null,null,null,null,null,null,null,null,271,null,0,0,0,0]
[null,null,null,null,null,null,null,null,null,null,null,null,null,null,null,null,null,null,null,null,null,null,null,null,null,null,null,null,null,272,null,0,0,0,0]
[null,null,null,null,null,null,null,null,null,null,null,null,null,null,null,null,null,null,null,null,null,null,null,null,null,null,null,null,null,273,null,0,0,0,0]
[null,null,null,null,null,null,null,null,null,null,null,null,null,null,null,null,null,null,null,null,null,null,null,null,null,null,null,null,null,274,null,0,0,0,0]
[null,null,null,null,null,null,null,null,null,null,null,null,null,null,null,null,null,null,null,null,null,null,null,null,null,null,null,null,null,275,null,0,0,0,0]
[null,null,null,null,null,null,null,null,null,null,null,null,null,null,null,null,null,null,null,null,null,null,null,null,null,null,null,null,null,276,null,0,0,0,0]
[null,null,null,null,null,null,null,null,null,null,null,null,null,null,null,null,null,null,null,null,null,null,null,null,null,null,null,null,null,277,null,0,0,0,0]
[null,null,null,null,null,null,null,null,null,null,null,null,null,null,null,null,null,null,null,null,null,null,null,null,null,null,null,null,null,278,null,0,0,0,0]
[null,null,null,null,null,null,null,null,null,null,null,null,null,null,null,null,null,null,null,null,null,null,null,null,null,null,null,null,null,279,null,0,0,0,0]
[null,null,null,null,null,null,null,null,null,null,null,null,null,null,null,null,null,null,null,null,null,null,null,null,null,null,null,null,null,280,null,0,0,0,0]
[null,null,null,null,null,null,null,null,null,null,null,null,null,null,null,null,null,null,null,null,null,null,null,null,null,null,null,null,null,281,null,0,0,0,0]
[null,null,null,null,null,null,null,null,null,null,null,null,null,null,null,null,null,null,null,null,null,null,null,null,null,null,null,null,null,282,null,0,0,0,0]
[null,null,null,null,null,null,null,null,null,null,null,null,null,null,null,null,null,null,null,null,null,null,null,null,null,null,null,null,null,283,null,0,0,0,0]
[null,null,null,null,null,null,null,null,null,null,null,null,null,null,null,null,null,null,null,null,null,null,null,null,null,null,null,null,null,284,null,0,0,0,0]
[null,null,null,null,null,null,null,null,null,null,null,null,null,null,null,null,null,null,null,null,null,null,null,null,null,null,null,null,null,285,null,0,0,0,0]
[null,null,null,null,null,null,null,null,null,null,null,null,null,null,null,null,null,null,null,null,null,null,null,null,null,null,null,null,null,286,null,0,0,0,0]
[null,null,null,null,null,null,null,null,null,null,null,null,null,null,null,null,null,null,null,null,null,null,null,null,null,null,null,null,null,287,null,0,0,0,0]
[null,null,null,null,null,null,null,null,null,null,null,null,null,null,null,null,null,null,null,null,null,null,null,null,null,null,null,null,null,288,null,0,0,0,0]
[null,null,null,null,null,null,null,null,null,null,null,null,null,null,null,null,null,null,null,null,null,null,null,null,null,null,null,null,null,289,null,0,0,0,0]
[null,null,null,null,null,null,null,null,null,null,null,null,null,null,null,null,null,null,null,null,null,null,null,null,null,null,null,null,null,290,null,0,0,0,0]
[null,null,null,null,null,null,null,null,null,null,null,null,null,null,null,null,null,null,null,null,null,null,null,null,null,null,null,null,null,291,null,0,0,0,0]
[null,null,null,null,null,null,null,null,null,null,null,null,null,null,null,null,null,null,null,null,null,null,null,null,null,null,null,null,null,292,null,0,0,0,0]
[null,null,null,null,null,null,null,null,null,null,null,null,null,null,null,null,null,null,null,null,null,null,null,null,null,null,null,null,null,293,null,0,0,0,0]
[null,null,null,null,null,null,null,null,null,null,null,null,null,null,null,null,null,null,null,null,null,null,null,null,null,null,null,null,null,294,null,0,0,0,0]
[null,null,null,null,null,null,null,null,null,null,null,null,null,null,null,null,null,null,null,null,null,null,null,null,null,null,null,null,null,295,null,0,0,0,0]
[null,null,null,null,null,null,null,null,null,null,null,null,null,null,null,null,null,null,null,null,null,null,null,null,null,null,null,null,null,296,null,0,0,0,0]
[null,null,null,null,null,null,null,null,null,null,null,null,null,null,null,null,null,null,null,null,null,null,null,null,null,null,null,null,null,297,null,0,0,0,0]
[null,null,null,null,null,null,null,null,null,null,null,null,null,null,null,null,null,null,null,null,null,null,null,null,null,null,null,null,null,298,null,0,0,0,0]
[null,null,null,null,null,null,null,null,null,null,null,null,null,null,null,null,null,null,null,null,null,null,null,null,null,null,null,null,null,299,null,0,0,0,0]
[null,null,null,null,null,null,null,null,null,null,null,null,null,null,null,null,null,null,null,null,null,null,null,null,null,null,null,null,null,300,null,0,0,0,0]
[null,null,null,null,null,null,null,null,null,null,null,null,null,null,null,null,null,null,null,null,null,null,null,null,null,null,null,null,null,301,null,0,0,0,0]
[null,null,null,null,null,null,null,null,null,null,null,null,null,null,null,null,null,null,null,null,null,null,null,null,null,null,null,null,null,302,null,0,0,0,0]
[null,null,null,null,null,null,null,null,null,null,null,null,null,null,null,null,null,null,null,null,null,null,null,null,null,null,null,null,null,303,null,0,0,0,0]
[null,null,null,null,null,null,null,null,null,null,null,null,null,null,null,null,null,null,null,null,null,null,null,null,null,null,null,null,null,304,null,0,0,0,0]
[null,null,null,null,null,null,null,null,null,null,null,null,null,null,null,null,null,null,null,null,null,null,null,null,null,null,null,null,null,305,null,0,0,0,0]
[null,null,null,null,null,null,null,null,null,null,null,null,null,null,null,null,null,null,null,null,null,null,null,null,null,null,null,null,null,306,null,0,0,0,{"$f":"IF(AD693>$C$7,0,AI692-AH693)","v":0}]
[null,null,null,null,null,null,null,null,null,null,null,null,null,null,null,null,null,null,null,null,null,null,null,null,null,null,null,null,null,307,null,0,0,0,0]
[null,null,null,null,null,null,null,null,null,null,null,null,null,null,null,null,null,null,null,null,null,null,null,null,null,null,null,null,null,308,null,0,0,0,0]
[null,null,null,null,null,null,null,null,null,null,null,null,null,null,null,null,null,null,null,null,null,null,null,null,null,null,null,null,null,309,null,0,0,0,0]
[null,null,null,null,null,null,null,null,null,null,null,null,null,null,null,null,null,null,null,null,null,null,null,null,null,null,null,null,null,310,null,0,0,0,0]
[null,null,null,null,null,null,null,null,null,null,null,null,null,null,null,null,null,null,null,null,null,null,null,null,null,null,null,null,null,311,null,0,0,0,0]
[null,null,null,null,null,null,null,null,null,null,null,null,null,null,null,null,null,null,null,null,null,null,null,null,null,null,null,null,null,312,null,0,0,0,0]
[null,null,null,null,null,null,null,null,null,null,null,null,null,null,null,null,null,null,null,null,null,null,null,null,null,null,null,null,null,313,null,0,0,0,0]
[null,null,null,null,null,null,null,null,null,null,null,null,null,null,null,null,null,null,null,null,null,null,null,null,null,null,null,null,null,314,null,0,0,0,0]
[null,null,null,null,null,null,null,null,null,null,null,null,null,null,null,null,null,null,null,null,null,null,null,null,null,null,null,null,null,315,null,0,0,0,0]
[null,null,null,null,null,null,null,null,null,null,null,null,null,null,null,null,null,null,null,null,null,null,null,null,null,null,null,null,null,316,null,0,0,0,0]
[null,null,null,null,null,null,null,null,null,null,null,null,null,null,null,null,null,null,null,null,null,null,null,null,null,null,null,null,null,317,null,0,0,0,0]
[null,null,null,null,null,null,null,null,null,null,null,null,null,null,null,null,null,null,null,null,null,null,null,null,null,null,null,null,null,318,null,0,0,0,0]
[null,null,null,null,null,null,null,null,null,null,null,null,null,null,null,null,null,null,null,null,null,null,null,null,null,null,null,null,null,319,null,0,0,0,0]
[null,null,null,null,null,null,null,null,null,null,null,null,null,null,null,null,null,null,null,null,null,null,null,null,null,null,null,null,null,320,null,0,0,0,0]
[null,null,null,null,null,null,null,null,null,null,null,null,null,null,null,null,null,null,null,null,null,null,null,null,null,null,null,null,null,321,null,0,0,0,0]
[null,null,null,null,null,null,null,null,null,null,null,null,null,null,null,null,null,null,null,null,null,null,null,null,null,null,null,null,null,322,null,0,0,0,0]
[null,null,null,null,null,null,null,null,null,null,null,null,null,null,null,null,null,null,null,null,null,null,null,null,null,null,null,null,null,323,null,{"$f":"IF(AD340>$C$7,0,IF($P$7=\"Oui\",ROUND($AE$14,2),O340))","v":0},{"$f":"IF($P$7=\"Oui\",AI339*$AF$13/12,E340)","v":0},{"$f":"IF($P$7=\"Oui\",AF710-AG710,Q340)","v":0},0]
[null,null,null,null,null,null,null,null,null,null,null,null,null,null,null,null,null,null,null,null,null,null,null,null,null,null,null,null,null,324,null,0,0,0,0]
[null,null,null,null,null,null,null,null,null,null,null,null,null,null,null,null,null,null,null,null,null,null,null,null,null,null,null,null,null,325,null,0,0,0,0]
[null,null,null,null,null,null,null,null,null,null,null,null,null,null,null,null,null,null,null,null,null,null,null,null,null,null,null,null,null,326,null,0,0,0,0]
[null,null,null,null,null,null,null,null,null,null,null,null,null,null,null,null,null,null,null,null,null,null,null,null,null,null,null,null,null,327,null,0,0,0,0]
[null,null,null,null,null,null,null,null,null,null,null,null,null,null,null,null,null,null,null,null,null,null,null,null,null,null,null,null,null,328,null,0,0,0,0]
[null,null,null,null,null,null,null,null,null,null,null,null,null,null,null,null,null,null,null,null,null,null,null,null,null,null,null,null,null,329,null,0,0,0,0]
[null,null,null,null,null,null,null,null,null,null,null,null,null,null,null,null,null,null,null,null,null,null,null,null,null,null,null,null,null,330,null,0,0,0,0]
[null,null,null,null,null,null,null,null,null,null,null,null,null,null,null,null,null,null,null,null,null,null,null,null,null,null,null,null,null,331,null,0,0,0,0]
[null,null,null,null,null,null,null,null,null,null,null,null,null,null,null,null,null,null,null,null,null,null,null,null,null,null,null,null,null,332,null,0,0,0,0]
[null,null,null,null,null,null,null,null,null,null,null,null,null,null,null,null,null,null,null,null,null,null,null,null,null,null,null,null,null,333,null,0,0,0,0]
[null,null,null,null,null,null,null,null,null,null,null,null,null,null,null,null,null,null,null,null,null,null,null,null,null,null,null,null,null,334,null,0,0,0,0]
[null,null,null,null,null,null,null,null,null,null,null,null,null,null,null,null,null,null,null,null,null,null,null,null,null,null,null,null,null,335,null,0,0,0,0]
[null,null,null,null,null,null,null,null,null,null,null,null,null,null,null,null,null,null,null,null,null,null,null,null,null,null,null,null,null,336,null,0,0,0,0]
[null,null,null,null,null,null,null,null,null,null,null,null,null,null,null,null,null,null,null,null,null,null,null,null,null,null,null,null,null,337,null,0,0,0,0]
[null,null,null,null,null,null,null,null,null,null,null,null,null,null,null,null,null,null,null,null,null,null,null,null,null,null,null,null,null,338,null,0,0,0,0]
[null,null,null,null,null,null,null,null,null,null,null,null,null,null,null,null,null,null,null,null,null,null,null,null,null,null,null,null,null,339,null,0,0,0,0]
[null,null,null,null,null,null,null,null,null,null,null,null,null,null,null,null,null,null,null,null,null,null,null,null,null,null,null,null,null,340,null,0,0,0,0]
[null,null,null,null,null,null,null,null,null,null,null,null,null,null,null,null,null,null,null,null,null,null,null,null,null,null,null,null,null,341,null,0,0,0,0]
[null,null,null,null,null,null,null,null,null,null,null,null,null,null,null,null,null,null,null,null,null,null,null,null,null,null,null,null,null,342,null,0,0,0,0]
[null,null,null,null,null,null,null,null,null,null,null,null,null,null,null,null,null,null,null,null,null,null,null,null,null,null,null,null,null,343,null,0,0,0,0]
[null,null,null,null,null,null,null,null,null,null,null,null,null,null,null,null,null,null,null,null,null,null,null,null,null,null,null,null,null,344,null,0,0,0,0]
[null,null,null,null,null,null,null,null,null,null,null,null,null,null,null,null,null,null,null,null,null,null,null,null,null,null,null,null,null,345,null,0,0,0,0]
[null,null,null,null,null,null,null,null,null,null,null,null,null,null,null,null,null,null,null,null,null,null,null,null,null,null,null,null,null,346,null,0,0,0,0]
[null,null,null,null,null,null,null,null,null,null,null,null,null,null,null,null,null,null,null,null,null,null,null,null,null,null,null,null,null,347,null,0,0,0,0]
[null,null,null,null,null,null,null,null,null,null,null,null,null,null,null,null,null,null,null,null,null,null,null,null,null,null,null,null,null,348,null,0,0,0,0]
[null,null,null,null,null,null,null,null,null,null,null,null,null,null,null,null,null,null,null,null,null,null,null,null,null,null,null,null,null,349,null,0,0,0,0]
[null,null,null,null,null,null,null,null,null,null,null,null,null,null,null,null,null,null,null,null,null,null,null,null,null,null,null,null,null,350,null,0,0,0,0]
[null,null,null,null,null,null,null,null,null,null,null,null,null,null,null,null,null,null,null,null,null,null,null,null,null,null,null,null,null,351,null,0,0,0,0]
[null,null,null,null,null,null,null,null,null,null,null,null,null,null,null,null,null,null,null,null,null,null,null,null,null,null,null,null,null,352,null,0,0,0,0]
[null,null,null,null,null,null,null,null,null,null,null,null,null,null,null,null,null,null,null,null,null,null,null,null,null,null,null,null,null,353,null,0,0,0,0]
[null,null,null,null,null,null,null,null,null,null,null,null,null,null,null,null,null,null,null,null,null,null,null,null,null,null,null,null,null,354,null,0,0,0,0]
[null,null,null,null,null,null,null,null,null,null,null,null,null,null,null,null,null,null,null,null,null,null,null,null,null,null,null,null,null,355,null,0,0,0,0]
[null,null,null,null,null,null,null,null,null,null,null,null,null,null,null,null,null,null,null,null,null,null,null,null,null,null,null,null,null,356,null,0,0,0,0]
[null,null,null,null,null,null,null,null,null,null,null,null,null,null,null,null,null,null,null,null,null,null,null,null,null,null,null,null,null,357,null,0,0,0,0]
[null,null,null,null,null,null,null,null,null,null,null,null,null,null,null,null,null,null,null,null,null,null,null,null,null,null,null,null,null,358,null,0,0,0,0]
[null,null,null,null,null,null,null,null,null,null,null,null,null,null,null,null,null,null,null,null,null,null,null,null,null,null,null,null,null,359,null,0,0,0,0]
[null,null,null,null,null,null,null,null,null,null,null,null,null,null,null,null,null,null,null,null,null,null,null,null,null,null,null,null,null,360,null,0,0,0,0]
[null,null,null,null,null,null,null,null,null,null,null,null,null,null,null,null,null,null,null,null,null,null,null,null,null,null,null,null,null,null,null,{"$f":"SUM(AF388:AF747)","v":121528.89000000036},{"$f":"SUM(AG388:AG747)","v":21528.89333333333},{"$f":"SUM(AH388:AH747)","v":100000.00000000009}]
[null,null,null,null,null,null,null,null,null,null,null,null,null,null,null,null,null,null,null,null,null,null,null,null,null,null,null,null,null,null,null,{"$f":"AH748+AG748","v":121528.89333333341}]

{"sheet":"Feuil2","index":1,"n_rows":0,"n_cols":0,"rows_kept":0,"cut":false,"hidden":false,"merged":[]}

{"sheet":"Feuil3","index":2,"n_rows":0,"n_cols":0,"rows_kept":0,"cut":false,"hidden":false,"merged":[]}